From mboxrd@z Thu Jan 1 00:00:00 1970 From: Tom Rini Date: Tue, 9 May 2017 19:59:13 -0400 Subject: [U-Boot] Please pull u-boot-fdt In-Reply-To: References: Message-ID: <20170509235913.GX12511@bill-the-cat> List-Id: MIME-Version: 1.0 Content-Type: text/plain; charset="us-ascii" Content-Transfer-Encoding: 7bit To: u-boot@lists.denx.de On Tue, May 09, 2017 at 04:53:36PM -0600, Simon Glass wrote: > Hi Tom, > > Here's the conversion to use the upstream pylibfdt implementation. > > > The following changes since commit 85ea850976daea57c8045f3569566fad5ce9fe0f: > > p1_p2_rdb: Fix unused variable warning (2017-05-09 09:11:04 -0400) > > are available in the git repository at: > > git://git.denx.de/u-boot-fdt.git > > for you to fetch changes up to 8fbd55f0f8730e3a6994798f4e533138d15be6aa: > > fdt: Drop fdt_select.py (2017-05-09 14:56:19 -0600) > NAK. I get: $ ./test/py/test.py --bd sandbox --build make O=/home/trini/work/u-boot/u-boot/build-sandbox -s sandbox_defconfig make O=/home/trini/work/u-boot/u-boot/build-sandbox -s -j8 Assembler messages: Fatal error: can't create build/temp.linux-x86_64-2.7/../lib/libfdt/fdt.o: No such file or directory error: command 'x86_64-linux-gnu-gcc' failed with exit status 1 make[2]: *** [tools/_libfdt.so] Error 1 make[2]: *** Waiting for unfinished jobs.... make[1]: *** [tools] Error 2 make: *** [sub-make] Error 2 Exit code: 2 -- Tom -------------- next part -------------- A non-text attachment was scrubbed... Name: signature.asc Type: application/pgp-signature Size: 819 bytes Desc: Digital signature URL: