From: kernel test robot <lkp@intel.com>
To: oe-kbuild@lists.linux.dev
Cc: lkp@intel.com
Subject: [mszeredi-fuse:for-next 3/7] make[1]: *** No rule to make target 'tools/testing/selftests/filesystems/fuse/test_syncfs', needed by 'all'.
Date: Wed, 02 Sep 2026 18:40:39 +0200 [thread overview]
Message-ID: <202609021808.5OxsIter-lkp@intel.com> (raw)
::::::
:::::: Manual check reason: "low confidence bisect report"
::::::
BCC: lkp@intel.com
CC: oe-kbuild-all@lists.linux.dev
CC: fuse-devel@lists.sourceforge.net
TO: Jimmy Zuber <jamz@amazon.com>
CC: Miklos Szeredi <mszeredi@redhat.com>
tree: https://git.kernel.org/pub/scm/linux/kernel/git/mszeredi/fuse.git for-next
head: 10bd6b32965265688fa277d166ab224de8e86eb2
commit: a6ca1a573e1fd9474c6226412fb743b4ef7e3472 [3/7] selftests/fuse: add test for FUSE_HAS_SYNCFS privilege gating
:::::: branch date: 9 hours ago
:::::: commit date: 9 hours ago
config: s390-allnoconfig-bpf (https://download.01.org/0day-ci/archive/20260902/202609021808.5OxsIter-lkp@intel.com/config)
compiler: s390x-linux-gnu-gcc (Debian 14.2.0-19) 14.2.0
reproduce (this is a W=1 build): (https://download.01.org/0day-ci/archive/20260902/202609021808.5OxsIter-lkp@intel.com/reproduce)
If you fix the issue in a separate patch/commit (i.e. not just a new version of
the same patch/commit), kindly add following tags
| Reported-by: kernel test robot <lkp@intel.com>
| Closes: https://lore.kernel.org/r/202609021808.5OxsIter-lkp@intel.com/
Note: the mszeredi-fuse/for-next HEAD 10bd6b32965265688fa277d166ab224de8e86eb2 builds fine.
It only hurts bisectability.
All errors (new ones prefixed by >>):
make[1]: *** [../../lib.mk:225: tools/testing/selftests/drivers/net/psp_responder] Error 1
make[1]: Target 'all' not remade because of errors.
>> make[1]: *** No rule to make target 'tools/testing/selftests/filesystems/fuse/test_syncfs', needed by 'all'.
make[1]: Target 'all' not remade because of errors.
make[1]: *** [Makefile:117: tools/testing/selftests/hid/host-tools/sbin/bpftool] Error 2
make[1]: Target 'all' not remade because of errors.
make[1]: *** No targets. Stop.
make[1]: *** [../lib.mk:225: tools/testing/selftests/net/busy_poller] Error 1
make[1]: *** [../lib.mk:224: tools/testing/selftests/net/tun] Error 1
make[1]: Target 'all' not remade because of errors.
Makefile:60: warning: overriding recipe for target 'emit_tests'
../lib.mk:182: warning: ignoring old recipe for target 'emit_tests'
make[1]: *** No targets. Stop.
make[1]: *** [../lib.mk:224: tools/testing/selftests/proc/proc-loadavg-001] Error 1
make[1]: *** [../lib.mk:224: tools/testing/selftests/proc/setns-sysvipc] Error 1
make[1]: *** [../lib.mk:224: tools/testing/selftests/proc/setns-dcache] Error 1
make[1]: *** [../lib.mk:224: tools/testing/selftests/proc/thread-self] Error 1
make[1]: *** [../lib.mk:224: tools/testing/selftests/proc/proc-tid0] Error 1
make[1]: *** [../lib.mk:224: tools/testing/selftests/proc/proc-pid-vm] Error 1
make[1]: Target 'all' not remade because of errors.
make[1]: *** No targets specified and no makefile found. Stop.
make[1]: Circular tools/testing/selftests/rseq/param_test <- tools/testing/selftests/rseq/param_test dependency dropped.
make[1]: Circular tools/testing/selftests/rseq/param_test_compare_twice <- tools/testing/selftests/rseq/param_test dependency dropped.
make[1]: Circular tools/testing/selftests/rseq/param_test_compare_twice <- tools/testing/selftests/rseq/param_test_compare_twice dependency dropped.
make[1]: Circular tools/testing/selftests/rseq/param_test_mm_cid <- tools/testing/selftests/rseq/param_test dependency dropped.
make[1]: Circular tools/testing/selftests/rseq/param_test_mm_cid <- tools/testing/selftests/rseq/param_test_compare_twice dependency dropped.
make[1]: Circular tools/testing/selftests/rseq/param_test_mm_cid <- tools/testing/selftests/rseq/param_test_mm_cid dependency dropped.
make[1]: Circular tools/testing/selftests/rseq/param_test_mm_cid_compare_twice <- tools/testing/selftests/rseq/param_test dependency dropped.
make[1]: Circular tools/testing/selftests/rseq/param_test_mm_cid_compare_twice <- tools/testing/selftests/rseq/param_test_compare_twice dependency dropped.
make[1]: Circular tools/testing/selftests/rseq/param_test_mm_cid_compare_twice <- tools/testing/selftests/rseq/param_test_mm_cid dependency dropped.
make[1]: Circular tools/testing/selftests/rseq/param_test_mm_cid_compare_twice <- tools/testing/selftests/rseq/param_test_mm_cid_compare_twice dependency dropped.
make[1]: Circular tools/testing/selftests/rseq/syscall_errors_test <- tools/testing/selftests/rseq/param_test dependency dropped.
make[1]: Circular tools/testing/selftests/rseq/syscall_errors_test <- tools/testing/selftests/rseq/param_test_compare_twice dependency dropped.
make[1]: Circular tools/testing/selftests/rseq/syscall_errors_test <- tools/testing/selftests/rseq/param_test_mm_cid dependency dropped.
make[1]: Circular tools/testing/selftests/rseq/syscall_errors_test <- tools/testing/selftests/rseq/param_test_mm_cid_compare_twice dependency dropped.
make[1]: Circular tools/testing/selftests/rseq/syscall_errors_test <- tools/testing/selftests/rseq/syscall_errors_test dependency dropped.
make[1]: Circular tools/testing/selftests/rseq/legacy_check <- tools/testing/selftests/rseq/param_test dependency dropped.
make[1]: Circular tools/testing/selftests/rseq/legacy_check <- tools/testing/selftests/rseq/param_test_compare_twice dependency dropped.
make[1]: Circular tools/testing/selftests/rseq/legacy_check <- tools/testing/selftests/rseq/param_test_mm_cid dependency dropped.
make[1]: Circular tools/testing/selftests/rseq/legacy_check <- tools/testing/selftests/rseq/param_test_mm_cid_compare_twice dependency dropped.
make[1]: Circular tools/testing/selftests/rseq/legacy_check <- tools/testing/selftests/rseq/syscall_errors_test dependency dropped.
make[1]: Circular tools/testing/selftests/rseq/legacy_check <- tools/testing/selftests/rseq/legacy_check dependency dropped.
make[1]: Circular tools/testing/selftests/rseq/slice_test <- tools/testing/selftests/rseq/param_test dependency dropped.
make[1]: Circular tools/testing/selftests/rseq/slice_test <- tools/testing/selftests/rseq/param_test_compare_twice dependency dropped.
make[1]: Circular tools/testing/selftests/rseq/slice_test <- tools/testing/selftests/rseq/param_test_mm_cid dependency dropped.
make[1]: Circular tools/testing/selftests/rseq/slice_test <- tools/testing/selftests/rseq/param_test_mm_cid_compare_twice dependency dropped.
make[1]: Circular tools/testing/selftests/rseq/slice_test <- tools/testing/selftests/rseq/syscall_errors_test dependency dropped.
make[1]: Circular tools/testing/selftests/rseq/slice_test <- tools/testing/selftests/rseq/legacy_check dependency dropped.
make[1]: Circular tools/testing/selftests/rseq/slice_test <- tools/testing/selftests/rseq/slice_test dependency dropped.
make[1]: Circular tools/testing/selftests/rseq/check_optimized <- tools/testing/selftests/rseq/param_test dependency dropped.
make[1]: Circular tools/testing/selftests/rseq/check_optimized <- tools/testing/selftests/rseq/param_test_compare_twice dependency dropped.
make[1]: Circular tools/testing/selftests/rseq/check_optimized <- tools/testing/selftests/rseq/param_test_mm_cid dependency dropped.
make[1]: Circular tools/testing/selftests/rseq/check_optimized <- tools/testing/selftests/rseq/param_test_mm_cid_compare_twice dependency dropped.
make[1]: Circular tools/testing/selftests/rseq/check_optimized <- tools/testing/selftests/rseq/syscall_errors_test dependency dropped.
make[1]: Circular tools/testing/selftests/rseq/check_optimized <- tools/testing/selftests/rseq/legacy_check dependency dropped.
make[1]: Circular tools/testing/selftests/rseq/check_optimized <- tools/testing/selftests/rseq/slice_test dependency dropped.
make[1]: Circular tools/testing/selftests/rseq/check_optimized <- tools/testing/selftests/rseq/check_optimized dependency dropped.
make[1]: *** [Makefile:67: tools/testing/selftests/rseq/param_test_mm_cid_compare_twice] Error 1
make[1]: Target 'all' not remade because of errors.
make[1]: *** No targets. Stop.
make[1]: *** No targets. Stop.
--
0-DAY CI Kernel Test Service
https://github.com/intel/lkp-tests/wiki
reply other threads:[~2026-09-02 16:40 UTC|newest]
Thread overview: [no followups] expand[flat|nested] mbox.gz Atom feed
Reply instructions:
You may reply publicly to this message via plain-text email
using any one of the following methods:
* Save the following mbox file, import it into your mail client,
and reply-to-all from there: mbox
Avoid top-posting and favor interleaved quoting:
https://en.wikipedia.org/wiki/Posting_style#Interleaved_style
* Reply using the --to, --cc, and --in-reply-to
switches of git-send-email(1):
git send-email \
--in-reply-to=202609021808.5OxsIter-lkp@intel.com \
--to=lkp@intel.com \
--cc=oe-kbuild@lists.linux.dev \
/path/to/YOUR_REPLY
https://kernel.org/pub/software/scm/git/docs/git-send-email.html
* If your mail client supports setting the In-Reply-To header
via mailto: links, try the mailto: link
Be sure your reply has a Subject: header at the top and a blank line
before the message body.
This is an external index of several public inboxes,
see mirroring instructions on how to clone and mirror
all data and code used by this external index.