From: bluez.test.bot@gmail.com
To: linux-bluetooth@vger.kernel.org, aluvala.sai.teja@intel.com
Subject: RE: Bluetooth: add hardware rfkill handling and test hook
Date: Wed, 30 Sep 2026 06:49:30 -0700 (PDT) [thread overview]
Message-ID: <6abd136a.afd65eb9.18ca84.2961@mx.google.com> (raw)
In-Reply-To: <ef968fe470971ee338366faf957e62d186af6858.1790752799.git.aluvala.sai.teja@intel.com>
[-- Attachment #1: Type: text/plain, Size: 13919 bytes --]
This is automated email and please do not reply to this email!
Dear submitter,
Thank you for submitting the patches to the linux bluetooth mailing list.
This is a CI test results with your patch series:
PW Link:https://patchwork.kernel.org/series/1176663/
---Test result---
Test Summary:
CheckPatch PASS 15.83 seconds
VerifyFixes PASS 1.10 seconds
VerifySignedoff PASS 0.21 seconds
GitLint PASS 2.35 seconds
SubjectPrefix PASS 5.76 seconds
BuildKernel FAIL 21.68 seconds
CheckAllWarning FAIL 25.76 seconds
CheckSparse FAIL 26.32 seconds
BuildKernel32 FAIL 22.21 seconds
CheckKernelLLVM FAIL 22.33 seconds
TestRunnerSetup FAIL 550.08 seconds
TestRunner_l2cap-tester FAIL 9.31 seconds
TestRunner_iso-tester FAIL 0.57 seconds
TestRunner_bnep-tester FAIL 0.10 seconds
TestRunner_mgmt-tester FAIL 0.10 seconds
TestRunner_rfcomm-tester FAIL 0.10 seconds
TestRunner_sco-tester FAIL 0.11 seconds
TestRunner_ioctl-tester FAIL 0.11 seconds
TestRunner_mesh-tester FAIL 0.10 seconds
TestRunner_smp-tester FAIL 0.10 seconds
TestRunner_userchan-tester FAIL 0.11 seconds
TestRunner_6lowpan-tester FAIL 0.11 seconds
IncrementalBuild FAIL 26.82 seconds
Details
##############################
Test: BuildKernel - FAIL
Desc: Build Kernel for Bluetooth
Output:
net/bluetooth/hci_debugfs.c: In function ‘force_hw_rfkill_read’:
net/bluetooth/hci_debugfs.c:351:19: error: implicit declaration of function ‘rfkill_hard_blocked’; did you mean ‘rfkill_soft_blocked’? [-Wimplicit-function-declaration]
351 | blocked = rfkill_hard_blocked(hdev->rfkill);
| ^~~~~~~~~~~~~~~~~~~
| rfkill_soft_blocked
make[4]: *** [scripts/Makefile.build:290: net/bluetooth/hci_debugfs.o] Error 1
make[4]: *** Waiting for unfinished jobs....
make[3]: *** [scripts/Makefile.build:551: net/bluetooth] Error 2
make[2]: *** [scripts/Makefile.build:551: net] Error 2
make[2]: *** Waiting for unfinished jobs....
make[1]: *** [/home/runner/work/bluetooth-next/bluetooth-next/src/src/Makefile:2229: .] Error 2
make: *** [Makefile:248: __sub-make] Error 2
##############################
Test: CheckAllWarning - FAIL
Desc: Run linux kernel with all warning enabled
Output:
net/bluetooth/hci_debugfs.c: In function ‘force_hw_rfkill_read’:
net/bluetooth/hci_debugfs.c:351:19: error: implicit declaration of function ‘rfkill_hard_blocked’; did you mean ‘rfkill_soft_blocked’? [-Wimplicit-function-declaration]
351 | blocked = rfkill_hard_blocked(hdev->rfkill);
| ^~~~~~~~~~~~~~~~~~~
| rfkill_soft_blocked
make[4]: *** [scripts/Makefile.build:290: net/bluetooth/hci_debugfs.o] Error 1
make[4]: *** Waiting for unfinished jobs....
make[3]: *** [scripts/Makefile.build:551: net/bluetooth] Error 2
make[2]: *** [scripts/Makefile.build:551: net] Error 2
make[2]: *** Waiting for unfinished jobs....
make[1]: *** [/home/runner/work/bluetooth-next/bluetooth-next/src/src/Makefile:2229: .] Error 2
make: *** [Makefile:248: __sub-make] Error 2
##############################
Test: CheckSparse - FAIL
Desc: Run sparse tool with linux kernel
Output:
net/bluetooth/hci_event.c: note: in included file (through include/net/bluetooth/hci_core.h):
./include/net/bluetooth/hci.h:2975:47: warning: array of flexible structures
./include/net/bluetooth/hci.h:3061:43: warning: array of flexible structures
drivers/bluetooth/hci_ag6xx.c:257:24: warning: restricted __le32 degrades to integer
drivers/bluetooth/hci_mrvl.c:170:23: warning: restricted __le16 degrades to integer
drivers/bluetooth/hci_mrvl.c:203:23: warning: restricted __le16 degrades to integer
net/bluetooth/hci_codec.c: note: in included file:
./include/net/bluetooth/hci_core.h:151:35: warning: array of flexible structures
net/bluetooth/sco.c: note: in included file:
./include/net/bluetooth/hci_core.h:151:35: warning: array of flexible structures
net/bluetooth/hci_debugfs.c: In function ‘force_hw_rfkill_read’:
net/bluetooth/hci_debugfs.c:351:19: error: implicit declaration of function ‘rfkill_hard_blocked’; did you mean ‘rfkill_soft_blocked’? [-Wimplicit-function-declaration]
351 | blocked = rfkill_hard_blocked(hdev->rfkill);
| ^~~~~~~~~~~~~~~~~~~
| rfkill_soft_blocked
make[4]: *** [scripts/Makefile.build:290: net/bluetooth/hci_debugfs.o] Error 1
make[4]: *** Waiting for unfinished jobs....
make[3]: *** [scripts/Makefile.build:551: net/bluetooth] Error 2
make[2]: *** [scripts/Makefile.build:551: net] Error 2
make[2]: *** Waiting for unfinished jobs....
drivers/bluetooth/virtio_bt.c:340:25: error: no generic selection for 'unsigned short virtio_cread_v'
drivers/bluetooth/virtio_bt.c:340:25: error: incompatible types in comparison expression (different base types):
drivers/bluetooth/virtio_bt.c:340:25: bad type *
drivers/bluetooth/virtio_bt.c:340:25: unsigned short *
drivers/bluetooth/virtio_bt.c:340:25: error: no generic selection for 'unsigned short [addressable] virtio_cread_v'
drivers/bluetooth/virtio_bt.c:343:25: error: no generic selection for 'unsigned short virtio_cread_v'
drivers/bluetooth/virtio_bt.c:343:25: error: incompatible types in comparison expression (different base types):
drivers/bluetooth/virtio_bt.c:343:25: bad type *
drivers/bluetooth/virtio_bt.c:343:25: unsigned short *
drivers/bluetooth/virtio_bt.c:343:25: error: no generic selection for 'unsigned short [addressable] virtio_cread_v'
drivers/bluetooth/virtio_bt.c:378:25: error: no generic selection for 'unsigned short virtio_cread_v'
drivers/bluetooth/virtio_bt.c:378:25: error: incompatible types in comparison expression (different base types):
drivers/bluetooth/virtio_bt.c:378:25: bad type *
drivers/bluetooth/virtio_bt.c:378:25: unsigned short *
drivers/bluetooth/virtio_bt.c:378:25: error: no generic selection for 'unsigned short [addressable] virtio_cread_v'
drivers/bluetooth/virtio_bt.c:381:25: error: no generic selection for 'unsigned short virtio_cread_v'
drivers/bluetooth/virtio_bt.c:381:25: error: incompatible types in comparison expression (different base types):
drivers/bluetooth/virtio_bt.c:381:25: bad type *
drivers/bluetooth/virtio_bt.c:381:25: unsigned short *
drivers/bluetooth/virtio_bt.c:381:25: error: no generic selection for 'unsigned short [addressable] virtio_cread_v'
drivers/bluetooth/hci_nokia.c:279:23: warning: incorrect type in assignment (different base types)
drivers/bluetooth/hci_nokia.c:279:23: expected unsigned short [usertype] baud
drivers/bluetooth/hci_nokia.c:279:23: got restricted __le16 [usertype]
drivers/bluetooth/hci_nokia.c:282:26: warning: incorrect type in assignment (different base types)
drivers/bluetooth/hci_nokia.c:282:26: expected unsigned short [usertype] sys_clk
drivers/bluetooth/hci_nokia.c:282:26: got restricted __le16 [usertype]
make[1]: *** [/home/runner/work/bluetooth-next/bluetooth-next/src/src/Makefile:2229: .] Error 2
make: *** [Makefile:248: __sub-make] Error 2
##############################
Test: BuildKernel32 - FAIL
Desc: Build 32bit Kernel for Bluetooth
Output:
net/bluetooth/hci_debugfs.c: In function ‘force_hw_rfkill_read’:
net/bluetooth/hci_debugfs.c:351:19: error: implicit declaration of function ‘rfkill_hard_blocked’; did you mean ‘rfkill_soft_blocked’? [-Wimplicit-function-declaration]
351 | blocked = rfkill_hard_blocked(hdev->rfkill);
| ^~~~~~~~~~~~~~~~~~~
| rfkill_soft_blocked
make[4]: *** [scripts/Makefile.build:290: net/bluetooth/hci_debugfs.o] Error 1
make[4]: *** Waiting for unfinished jobs....
make[3]: *** [scripts/Makefile.build:551: net/bluetooth] Error 2
make[2]: *** [scripts/Makefile.build:551: net] Error 2
make[2]: *** Waiting for unfinished jobs....
make[1]: *** [/home/runner/work/bluetooth-next/bluetooth-next/src/src/Makefile:2229: .] Error 2
make: *** [Makefile:248: __sub-make] Error 2
##############################
Test: CheckKernelLLVM - FAIL
Desc: Build kernel with LLVM + context analysis
Output:
net/bluetooth/hci_debugfs.c:351:12: error: call to undeclared function 'rfkill_hard_blocked'; ISO C99 and later do not support implicit function declarations [-Wimplicit-function-declaration]
351 | blocked = rfkill_hard_blocked(hdev->rfkill);
| ^
net/bluetooth/hci_debugfs.c:351:12: note: did you mean 'rfkill_soft_blocked'?
./include/linux/rfkill.h:313:20: note: 'rfkill_soft_blocked' declared here
313 | static inline bool rfkill_soft_blocked(struct rfkill *rfkill)
| ^
net/bluetooth/hci_debugfs.c:379:16: error: call to undeclared function 'rfkill_hard_blocked'; ISO C99 and later do not support implicit function declarations [-Wimplicit-function-declaration]
379 | if (enable == rfkill_hard_blocked(hdev->rfkill)) {
| ^
2 errors generated.
make[4]: *** [scripts/Makefile.build:290: net/bluetooth/hci_debugfs.o] Error 1
make[4]: *** Waiting for unfinished jobs....
make[3]: *** [scripts/Makefile.build:551: net/bluetooth] Error 2
make[2]: *** [scripts/Makefile.build:551: net] Error 2
make[2]: *** Waiting for unfinished jobs....
make[1]: *** [/home/runner/work/bluetooth-next/bluetooth-next/src/src/Makefile:2229: .] Error 2
make: *** [Makefile:248: __sub-make] Error 2
##############################
Test: TestRunnerSetup - FAIL
Desc: Setup kernel and bluez for test-runner
Output:
Kernel:
net/bluetooth/hci_debugfs.c: In function ‘force_hw_rfkill_read’:
net/bluetooth/hci_debugfs.c:351:19: error: implicit declaration of function ‘rfkill_hard_blocked’; did you mean ‘rfkill_soft_blocked’? [-Wimplicit-function-declaration]
351 | blocked = rfkill_hard_blocked(hdev->rfkill);
| ^~~~~~~~~~~~~~~~~~~
| rfkill_soft_blocked
make[4]: *** [scripts/Makefile.build:290: net/bluetooth/hci_debugfs.o] Error 1
make[4]: *** Waiting for unfinished jobs....
make[3]: *** [scripts/Makefile.build:551: net/bluetooth] Error 2
make[2]: *** [scripts/Makefile.build:551: net] Error 2
make[2]: *** Waiting for unfinished jobs....
make[1]: *** [/home/runner/work/bluetooth-next/bluetooth-next/src/src/Makefile:2229: .] Error 2
make: *** [Makefile:248: __sub-make] Error 2
##############################
Test: TestRunner_l2cap-tester - FAIL
Desc: Run l2cap-tester with test-runner
Output:
No kernel image found
##############################
Test: TestRunner_iso-tester - FAIL
Desc: Run iso-tester with test-runner
Output:
No kernel image found
##############################
Test: TestRunner_bnep-tester - FAIL
Desc: Run bnep-tester with test-runner
Output:
No kernel image found
##############################
Test: TestRunner_mgmt-tester - FAIL
Desc: Run mgmt-tester with test-runner
Output:
No kernel image found
##############################
Test: TestRunner_rfcomm-tester - FAIL
Desc: Run rfcomm-tester with test-runner
Output:
No kernel image found
##############################
Test: TestRunner_sco-tester - FAIL
Desc: Run sco-tester with test-runner
Output:
No kernel image found
##############################
Test: TestRunner_ioctl-tester - FAIL
Desc: Run ioctl-tester with test-runner
Output:
No kernel image found
##############################
Test: TestRunner_mesh-tester - FAIL
Desc: Run mesh-tester with test-runner
Output:
No kernel image found
##############################
Test: TestRunner_smp-tester - FAIL
Desc: Run smp-tester with test-runner
Output:
No kernel image found
##############################
Test: TestRunner_userchan-tester - FAIL
Desc: Run userchan-tester with test-runner
Output:
No kernel image found
##############################
Test: TestRunner_6lowpan-tester - FAIL
Desc: Run 6lowpan-tester with test-runner
Output:
No kernel image found
##############################
Test: IncrementalBuild - FAIL
Desc: Incremental build with the patches in the series
Output:
net/bluetooth/hci_debugfs.c: In function ‘force_hw_rfkill_read’:
net/bluetooth/hci_debugfs.c:351:19: error: implicit declaration of function ‘rfkill_hard_blocked’; did you mean ‘rfkill_soft_blocked’? [-Wimplicit-function-declaration]
351 | blocked = rfkill_hard_blocked(hdev->rfkill);
| ^~~~~~~~~~~~~~~~~~~
| rfkill_soft_blocked
make[4]: *** [scripts/Makefile.build:290: net/bluetooth/hci_debugfs.o] Error 1
make[3]: *** [scripts/Makefile.build:551: net/bluetooth] Error 2
make[2]: *** [scripts/Makefile.build:551: net] Error 2
make[1]: *** [/home/runner/work/bluetooth-next/bluetooth-next/src/src/Makefile:2229: .] Error 2
make: *** [Makefile:248: __sub-make] Error 2
[v1,4/4] Bluetooth: hci_debugfs: add force_hw_rfkill test hook
net/bluetooth/hci_debugfs.c: In function ‘force_hw_rfkill_read’:
net/bluetooth/hci_debugfs.c:351:19: error: implicit declaration of function ‘rfkill_hard_blocked’; did you mean ‘rfkill_soft_blocked’? [-Wimplicit-function-declaration]
351 | blocked = rfkill_hard_blocked(hdev->rfkill);
| ^~~~~~~~~~~~~~~~~~~
| rfkill_soft_blocked
make[4]: *** [scripts/Makefile.build:290: net/bluetooth/hci_debugfs.o] Error 1
make[3]: *** [scripts/Makefile.build:551: net/bluetooth] Error 2
make[2]: *** [scripts/Makefile.build:551: net] Error 2
make[1]: *** [/home/runner/work/bluetooth-next/bluetooth-next/src/src/Makefile:2229: .] Error 2
make: *** [Makefile:248: __sub-make] Error 2
https://github.com/bluez/bluetooth-next/pull/844
---
Regards,
Linux Bluetooth
next prev parent reply other threads:[~2026-09-30 13:49 UTC|newest]
Thread overview: 7+ messages / expand[flat|nested] mbox.gz Atom feed top
2026-09-30 7:42 [PATCH v1 0/4] Bluetooth: add hardware rfkill handling and test hook Sai Teja Aluvala
2026-09-30 7:42 ` [PATCH v1 1/4] Bluetooth: Add interface to allow stack to communicate hw rfkill events Sai Teja Aluvala
2026-09-30 13:49 ` bluez.test.bot [this message]
2026-09-30 7:42 ` [PATCH v1 2/4] Bluetooth: hci_core: clear hdev->rfkill after destroying it Sai Teja Aluvala
2026-09-30 7:42 ` [PATCH v1 3/4] Bluetooth: btintel_pcie: add HW rfkill interrupt/doorbell flow Sai Teja Aluvala
2026-09-30 7:42 ` [PATCH v1 4/4] Bluetooth: hci_debugfs: add force_hw_rfkill test hook Sai Teja Aluvala
2026-09-30 12:56 ` Luiz Augusto von Dentz
Reply instructions:
You may reply publicly to this message via plain-text email
using any one of the following methods:
* Save the following mbox file, import it into your mail client,
and reply-to-all from there: mbox
Avoid top-posting and favor interleaved quoting:
https://en.wikipedia.org/wiki/Posting_style#Interleaved_style
* Reply using the --to, --cc, and --in-reply-to
switches of git-send-email(1):
git send-email \
--in-reply-to=6abd136a.afd65eb9.18ca84.2961@mx.google.com \
--to=bluez.test.bot@gmail.com \
--cc=aluvala.sai.teja@intel.com \
--cc=linux-bluetooth@vger.kernel.org \
/path/to/YOUR_REPLY
https://kernel.org/pub/software/scm/git/docs/git-send-email.html
* If your mail client supports setting the In-Reply-To header
via mailto: links, try the mailto: link
Be sure your reply has a Subject: header at the top and a blank line
before the message body.
This is an external index of several public inboxes,
see mirroring instructions on how to clone and mirror
all data and code used by this external index.