All of lore.kernel.org
 help / color / mirror / Atom feed
 messages from 2026-10-04 04:06:46 to 2026-10-04 07:02:35 UTC [more...]

[PATCH] RDMA/rxe: Validate inline data range in user WQEs
 2026-10-04  7:02 UTC  (6+ messages)
    `  "

[PATCH net-next v15 0/5] net: rnpgbe: Add TX/RX and link status support
 2026-10-04  6:59 UTC  (6+ messages)
` [PATCH net-next v15 1/5] net: rnpgbe: Add interrupt handling
` [PATCH net-next v15 2/5] net: rnpgbe: Add basic TX packet transmission support
` [PATCH net-next v15 3/5] net: rnpgbe: Add basic RX data path support
` [PATCH net-next v15 4/5] net: rnpgbe: Add receive mode support
` [PATCH net-next v15 5/5] net: rnpgbe: Add link status handling support

[PATCH net v4] net: axienet: cap the TX poll return value at the NAPI budget
 2026-10-04  7:00 UTC  (3+ messages)

[PATCH net v5] net: axienet: do not report TX completions as NAPI work
 2026-10-04  6:59 UTC 

[PATCH v2 00/10] hw/arm: Enable U-Boot boot on MCIMX6UL-EVK
 2026-10-04  6:58 UTC  (7+ messages)
` [PATCH v2 01/10] hw/arm: fsl-imx6ul: Add SCU compatibility window

[PATCH v3] RDMA/rxe: Validate inline data range in user WQEs
 2026-10-04  6:53 UTC  (2+ messages)

[PATCH dwarves] dwarf_loader: Limit parameter location analysis to x86_64 and arm64
 2026-10-04  6:50 UTC  (3+ messages)

[pull-request] mlx5: Move data direct infrastructure to mlx5_core
 2026-10-04  6:49 UTC 

[linux-next:master 2553/14185] Warning: drivers/mtd/spi-nor/sfdp.c:417 function parameter 'bfpt' not described in 'spi_nor_post_bfpt_fixups'
 2026-10-04  6:47 UTC 

[meta-oe][scarthgap][PATCH] spidev-test: clean the build dir before configure
 2026-10-04  6:23 UTC 

[meta-oe][wrynose][PATCH] spidev-test: clean the build dir before configure
 2026-10-04  6:31 UTC 

[PATCH net v4 2/2] selftests: net: add TAP socket filter attach tests
 2026-10-04  6:39 UTC  (2+ messages)

[PATCH net v4 1/2] tun: keep a kernel copy of the socket filter program
 2026-10-04  6:39 UTC  (2+ messages)

pinctrl: sunxi: a733: irq_banks too small for port K
 2026-10-04  6:38 UTC 

drivers/media/pci/intel/ipu6/ipu7-boot.c:249:17: error: implicit declaration of function 'ipu7_release_boot_config'; did you mean 'ipu6_ipu7_release_boot_config'?
 2026-10-04  6:36 UTC 

[PATCH net-next v2 0/8] net/tls: Receive-path fixes for zero-length data records
 2026-10-04  6:36 UTC  (2+ messages)

[PATCH] mm/vmalloc: bail out early on invalid page_shift in __vmap_pages_range_noflush()
 2026-10-04  6:34 UTC  (2+ messages)

[PATCH 0/3] Add Loongson-2K0300 APB DMA mux support
 2026-10-04  6:27 UTC  (6+ messages)
` [PATCH 2/3] dt-bindings: dma: loongson: Add Loongson-2K0300 "

[PATCH] ALSA: hda/realtek: Add quirk for ASRock NUC BOX-358H
 2026-10-04  6:26 UTC  (4+ messages)

[RFC PATCH v8 00/10] vmapple: making it work on the latest macOS host releases
 2026-10-04  6:24 UTC  (5+ messages)
` [RFC PATCH v8 05/10] vmapple: apple-gfx: make it work on the latest macOS release

[PATCH v2 00/21] Add speaker and headset jack support for Apple Silicon Macs
 2026-10-04  6:25 UTC  (31+ messages)
` [PATCH v2 01/21] ASoC: dt-bindings: cs42l84: Document sound-name-prefix property
` [PATCH v2 02/21] ASoC: dt-bindings: cs42l42: Do not require chip power supplies
` [PATCH v2 03/21] ASoC: dt-bindings: cs42l42: Document #sound-dai-cells property
` [PATCH v2 04/21] ASoC: dt-bindings: cs42l42: Document sound-name-prefix property
` [PATCH v2 05/21] ASoC: dt-bindings: Add binding for Apple Silicon Mac audio
` [PATCH v2 06/21] ASoC: ops: Introduce 'snd_soc_deactivate_kctl'
` [PATCH v2 07/21] ASoC: ops: Introduce 'soc_set_enum_kctl'
` [PATCH v2 08/21] ASoC: card: Let 'fixup_controls' return errors
` [PATCH v2 09/21] ASoC: apple: Add macaudio machine driver
` [PATCH v2 10/21] arm64: dts: apple: t8103-j274: Add speaker/headset jack nodes
` [PATCH v2 11/21] arm64: dts: apple: t8103-j313: "
` [PATCH v2 12/21] arm64: dts: apple: t8103-j293: "
` [PATCH v2 13/21] arm64: dts: apple: t8103-j45x: Add headset "
` [PATCH v2 14/21] arm64: dts: apple: t8112-j413: Add speaker/headset "
` [PATCH v2 15/21] arm64: dts: apple: t8112-j415: "
` [PATCH v2 16/21] arm64: dts: apple: t8112-j473: "
` [PATCH v2 17/21] arm64: dts: apple: t8112-j493: "
` [PATCH v2 18/21] arm64: dts: apple: t600x-j31x: "
` [PATCH v2 19/21] arm64: dts: apple: t600x-j375: "
` [PATCH v2 20/21] arm64: dts: apple: t602x-j41x: "
` [PATCH v2 21/21] arm64: dts: apple: t602x-j47x: "

[linuxtv-media-pending:next] BUILD SUCCESS d38c344454255144ddceda0c13fc40c9dec339fd
 2026-10-04  6:24 UTC 

[tnguy-next-queue:dev-queue] BUILD SUCCESS 1f36fe17921d233ec46f13d4127f7fa4af6f1162
 2026-10-04  6:22 UTC 

[PATCH v3 00/10] Add Rust PCI SR-IOV support
 2026-10-04  6:21 UTC  (10+ messages)
` [PATCH v3 07/10] rust: pci: add typed SR-IOV PF registration data
` [PATCH v3 08/10] rust: pci: add SR-IOV enable and disable tokens
` [PATCH v3 10/10] samples: rust: add Rust SR-IOV VF driver sample

[geert-renesas-devel:renesas-dts-for-v7.4] BUILD SUCCESS d99e991749f3b12a3a8b23224725dbc1ca15f6bf
 2026-10-04  6:19 UTC 

[geert-renesas-devel:next] BUILD SUCCESS fb050251fd4fe3b4d0231495651901626c2a1464
 2026-10-04  6:18 UTC 

[PATCH 1/2] kbuild: Pass -Eno-node_name_not_empty to DTC if supported
 2026-10-04  6:17 UTC  (2+ messages)
` [PATCH 2/2] kbuild: Do not pass -Wno-graph_child_address to DTC unless supported

[soc:for-next] BUILD SUCCESS 8edc6ba15f434fd2b7a58c3151061bd6b6a19aa4
 2026-10-04  6:17 UTC 

[PATCH v9 0/9] perf tools: Add progress diagnostics and a false-sharing workload
 2026-10-04  6:17 UTC  (19+ messages)
` [PATCH v9 1/9] perf config: Move perf_config__set_variable() to util/config.c
` [PATCH v9 2/9] perf config: Make perf_etc_perfconfig() never return NULL
` [PATCH v9 3/9] perf mutex: Add DEFINE_MUTEX() static initializer
` [PATCH v9 4/9] perf mutex: Add DO_ONCE() for one-time initialization
` [PATCH v9 5/9] perf config: Serialize config file access with a mutex
` [PATCH v9 6/9] perf report: Add --progress option
` [PATCH v9 7/9] perf report: Add --no-progress option
` [PATCH v9 8/9] perf scripts: Add perf-stuck, to tell where a running perf is stuck
` [PATCH v9 9/9] perf test: Add false_sharing workload exhibiting cross-CPU false sharing

[RFC PATCH v3 00/13] lib, sched: Introduce sparsebitmap (sbm)
 2026-10-04  6:17 UTC  (6+ messages)
` [RFC PATCH v3 09/13] x86/cpu/topology: Initialize sbm topology after topology parsing

[f2fs-dev] [PATCH] f2fs: skip further SIT updates for already invalidated blocks
 2026-10-04  6:10 UTC 

[PATCH] thunderbolt: Preserve pre-boot PCIe tunnels for active storage devices
 2026-10-04  6:09 UTC  (3+ messages)

[PATCH net-next 7/7] docs: networking: Add documentation for the coalescing support in rmnet
 2026-10-04  6:05 UTC  (2+ messages)

[PATCH net-next 6/7] net: qualcomm: rmnet: Add ethtool stats for DL coalescing
 2026-10-04  6:05 UTC  (2+ messages)

[PATCH net-next 5/7] net: qualcomm: rmnet: Work around coalescing hardware quirks
 2026-10-04  6:05 UTC  (2+ messages)

[PATCH net-next 4/7] net: qualcomm: rmnet: Add DL packet coalescing support
 2026-10-04  6:05 UTC  (2+ messages)

[PATCH net-next 3/7] net: qualcomm: rmnet: Restrict supported MAP checksum configurations
 2026-10-04  6:05 UTC  (2+ messages)

[PATCH net-next 1/7] uapi: if_link: Add RMNET_FLAGS_INGRESS_COALESCE
 2026-10-04  6:05 UTC  (2+ messages)

[PATCH] md/raid5: set conf->mddev before the first setup_conf() error path
 2026-10-04  6:02 UTC 

[PATCH] md: don't hand out the array before md_alloc() has added mddev->kobj
 2026-10-04  5:57 UTC 

[PATCH v1 0/5] gpio: Move most of the Intel GPIO to the dedicated folder
 2026-10-04  5:48 UTC  (3+ messages)
` [PATCH v1 3/5] gpio: Move Intel PCH type of GPIO drivers to the intel subfolder

drivers/gpu/drm/drm_pagemap.c:480:12: error: call to '__compiletime_assert_425' declared with 'error' attribute: BUILD_BUG failed
 2026-10-04  5:45 UTC 

[PATCH net-next v15 00/13] ax88179_178a: Add support for AX88179A-based chips
 2026-10-04  5:46 UTC  (3+ messages)
` [PATCH v15 0/13] "

[PATCH] iio: ssp: Serialize watchdog timer state changes
 2026-10-04  5:39 UTC  (4+ messages)
  ` [PATCH v2] "

include/linux/mm_inline.h:149:2: error: call to '__compiletime_assert_501' declared with 'error' attribute: BUILD_BUG_ON failed: fls(LRU_REFS_MAX - 1) > MAX_NR_TIERS - 1
 2026-10-04  5:41 UTC 

[PATCH net-next v16 00/13] ax88179_178a: Add support for AX88179A-based chips
 2026-10-04  5:39 UTC  (14+ messages)
` [PATCH net-next v16 01/13] phylink: Add phylink_mac_interrupt
` [PATCH net-next v16 02/13] phylib: Add support for PHYs with broken forced mode
` [PATCH net-next v16 03/13] ax88179_178a: Split driver into library and device specific code
` [PATCH net-next v16 04/13] ax88179_178a: Add HW support for AX179A-based chips
` [PATCH net-next v16 05/13] ax88179_178a: Add EEE configuration support for AX88179A MACs
` [PATCH net-next v16 06/13] ax88179_178a: Add EEE configuration support for AX88179A PHYs
` [PATCH net-next v16 07/13] ax88179_178a: Add VLAN offload support for AX88179A
` [PATCH net-next v16 08/13] ax88179_178a: Add AX179A/AX279 multicast configuration
` [PATCH net-next v16 09/13] ax88179_178a: Add Suspend/resume support for AX88179A/772D/279
` [PATCH net-next v16 10/13] ax88179_178a: Add ethtool get_drvinfo
` [PATCH net-next v16 11/13] ax88179_178a: Update driver name and information
` [PATCH net-next v16 12/13] ax88179_178a: Add support for AX88179A/772D/279 EEPROM access
` [PATCH net-next v16 13/13] ax88796b: Add support for AX88772D, AX88179A and AX88279

[RFC PROTOTYPE] mm: reliable 1GB page allocation
 2026-10-04  5:36 UTC 

drivers/clk/berlin/sl261x-pll.c:104 sl261x_pll_register() warn: variable dereferenced before check 'dev' (see line 97)
 2026-10-04  5:35 UTC 

[PATCH] staging: rtl8723bs: rename dot118021x_UncstKey to dot118021x_uncst_key
 2026-10-04  5:34 UTC  (2+ messages)

[PATCH v3] staging: rtl8723bs: condense NDIS encryption status enum
 2026-10-04  5:33 UTC  (2+ messages)

[pci:next 20/29] drivers/pci/controller/dwc/pcie-rcar-gen4.c:307:37: error: 'PCIE_PORT_LANE_SKEW' undeclared; did you mean 'PORT_LANE_SKEW'?
 2026-10-04  5:30 UTC 

[AUH] python3-zipp: upgrading to 4.1.1 SUCCEEDED
 2026-10-04  5:24 UTC 

[AUH] python3-websockets: upgrading to 17.2 SUCCEEDED
 2026-10-04  5:24 UTC 

[AUH] libical: upgrading to 4.0.6 FAILED
 2026-10-04  5:24 UTC 

[AUH] Upgrade status: 2026-10-04
 2026-10-04  5:24 UTC 

[AUH] xorgproto: upgrading to 2026.1 SUCCEEDED
 2026-10-04  5:24 UTC 

[AUH] python3-pytz: upgrading to 2026.5 SUCCEEDED
 2026-10-04  5:24 UTC 

[AUH] python3-uv-build: upgrading to 0.12.23 SUCCEEDED
 2026-10-04  5:24 UTC 

[PATCH net v3 2/2] xfrm: iptfs: hold a device reference while packets are queued
 2026-10-04  5:22 UTC  (2+ messages)

[PATCH net v3 1/2] xfrm: iptfs: track independent drop deadlines
 2026-10-04  5:22 UTC  (2+ messages)

[PATCH] dlm: don't return a lkb that has no rsb from find_lkb()
 2026-10-04  5:19 UTC  (2+ messages)
` [PATCH v2] dlm: don't publish a lkb in ls_lkbxa before it has an rsb

[PATCH] crypto: algif_skcipher: rewind rounded output bytes
 2026-10-04  5:09 UTC 

[rafael-pm:bleeding-edge] BUILD SUCCESS 1729fbce1c728686abb2f08350996b45cec7830c
 2026-10-04  5:04 UTC 

[geert-renesas-devel:master] BUILD SUCCESS cbceb2fcd5e158663c8c1d5e53ea91cbe8fb0797
 2026-10-04  5:03 UTC 

[pci:pwrctrl] BUILD SUCCESS d0103519d4fec56132f6d6f074ee04cd4af2627d
 2026-10-04  5:02 UTC 

[pci:controller:tegra264] BUILD SUCCESS 42b5b17cf4bb6154028b31f12db94ecb9069fd74
 2026-10-04  5:02 UTC 

[linusw-pinctrl:devel] BUILD SUCCESS 39b717b20c09028ee293b949a96325c0aa89a1a0
 2026-10-04  4:59 UTC 

[linusw-pinctrl:for-next] BUILD SUCCESS 3b9c0102861ab5658d79c147a778702bd01dad73
 2026-10-04  5:00 UTC 

[tty:tty-linus] BUILD SUCCESS 6c95ca52f27855dd2fb74131c8d4e8325d2af7de
 2026-10-04  4:57 UTC 

[PATCH net] vhost/vsock: trim nonlinear SKBs to declared payload length
 2026-10-04  4:57 UTC  (2+ messages)

[PATCH net-next v2 0/2] net: annotate remaining lockless sk->sk_err accesses
 2026-10-04  4:44 UTC  (6+ messages)
` [PATCH net-next v2 1/2] tls: annotate lockless access to sk->sk_err
` [PATCH net-next v2 2/2] net: annotate lockless writes "

[PATCH v2 00/15] PCI: rcar-gen4: Recover from link down and route Root Port interrupts
 2026-10-04  4:40 UTC  (7+ messages)
` [PATCH v2 11/15] PCI: rcar-gen4: Recover the Root Port on link down
` [PATCH v2 13/15] PCI: rcar-gen4: Route Root Port AER to a virtual Root Port IRQ
` [PATCH v2 14/15] PCI: rcar-gen4: Route Root Port PME and bandwidth notifications

[drm-xe:drm-xe-next] BUILD SUCCESS cf4171a20d13918e07ed01a1e01a6b546825c601
 2026-10-04  4:38 UTC 

[PATCH] power: supply: pf1550: drain IRQ work before unregistering supplies
 2026-10-04  4:37 UTC 

lab-cip-cybertrust
 2026-10-04  4:36 UTC  (3+ messages)
` [cip-dev] lab-cip-cybertrust

[PATCH] ASoC: stm: stm32_i2s: request IRQ after regmap initialization
 2026-10-04  4:34 UTC 

[PATCH v2] lib/crypto: chacha20poly1305: zeroize state in __chacha20poly1305_decrypt
 2026-10-04  4:34 UTC 

[syzbot] Monthly mmc report (Oct 2026)
 2026-10-04  4:33 UTC 

[LTP] [PATCH] epoll_pwait04: Use raw syscalls to avoid SIGSEGV on 32-bit Bionic
 2026-10-04  4:31 UTC  (2+ messages)
` [LTP] "

[LTP] [PATCH] sched_{set, get}attr: Call the syscalls via tst_syscall()
 2026-10-04  4:30 UTC  (2+ messages)
` [LTP] "

[xiang-erofs:dev-test] BUILD SUCCESS 6ad72f8c839a25b83d5aeaa65c233602151bca44
 2026-10-04  4:29 UTC 

[usb:usb-next] BUILD SUCCESS 639df5d23876a548b86fe6526bed8b97edf64d96
 2026-10-04  4:30 UTC 

[dtor-input:master] BUILD SUCCESS 1a3ba2dc2b91d50201a9d4721f166e68f4903eb6
 2026-10-04  4:30 UTC 

[bluetooth-next:master] BUILD SUCCESS 036d4119079a757c9d1b4d35205c7c467f0018fb
 2026-10-04  4:28 UTC 

[dtor-input:for-linus] BUILD SUCCESS 3bf8d603fd45649c106cae6290a10f20b1bbb569
 2026-10-04  4:29 UTC 

[tnguy-next-queue:10GbE] BUILD SUCCESS WITH WARNING f49defea7668d8c68ec19fa085ef3da6075561c7
 2026-10-04  4:28 UTC 

[tj-cgroup:for-7.4] BUILD SUCCESS d5632ae015028376668ef29e3a24c099611a55c7
 2026-10-04  4:27 UTC 

[tj-cgroup:for-next] BUILD SUCCESS 7965da4a7fc0a2b2e7d599021f7e6157c80f8704
 2026-10-04  4:27 UTC 

[tj-cgroup:for-7.3-fixes] BUILD SUCCESS 23b1ab15ca91f2cffaf149d9bb0fafeb700c7db2
 2026-10-04  4:26 UTC 

[PATCH net v2] net: nixge: stop IRQ producers before draining DMA error tasklet
 2026-10-04  4:27 UTC 

[PATCH] crypto: marvell/octeontx - clean up VF resources when DOWN fails
 2026-10-04  4:26 UTC 

[PATCH net] net: nixge: stop IRQ producers before draining DMA error tasklet
 2026-10-04  4:26 UTC  (3+ messages)

[rdma:wip:leon-for-next] BUILD SUCCESS d2c08575500145dc5cb55075cd9b177626531613
 2026-10-04  4:25 UTC 

[PATCH] net/af_packet: add capture direction option
 2026-10-04  4:22 UTC 

[GIT PULL] EDAC urgent for v7.3-rc6
 2026-10-04  4:20 UTC  (2+ messages)

[PATCH] md/raid5: drain released_stripes before destroying the cache
 2026-10-04  4:17 UTC  (2+ messages)

[kees:dev/v7.3-rc2/seq_buf/v3 4/11] ERROR: modpost: lib/tests/seq_buf_kunit.ko: symbol 'seq_buf_path' undefined!
 2026-10-04  4:13 UTC 

[PATCH net-next] net: bridge: cfm: notify userspace on CFM config changes
 2026-10-04  4:13 UTC 

[PATCH iproute2-next 0/2] bridge: add cfm command
 2026-10-04  4:13 UTC  (3+ messages)
` [PATCH iproute2-next 1/2] uapi: import cfm_bridge.h
` [PATCH iproute2-next 2/2] bridge: add cfm command

[PATCH] power: supply: sbs-battery: disable polling before supply teardown
 2026-10-04  4:10 UTC 

[PATCH v5 00/23] Add basic clocks and resets for JHB100 SoC
 2026-10-04  4:09 UTC  (5+ messages)
` [PATCH v5 10/23] clk: starfive: Add JHB100 System-2 clock generator driver

[dwmw2:r64-bench 14/14] drivers/pps/clients/pps-gpio.c:17:10: fatal error: 'asm/clock_inlined.h' file not found
 2026-10-04  4:06 UTC 

[thomas-weissschuh:b4/rust-kunit-assertion 15/15] error: literal out of range for `i32`
 2026-10-04  4:06 UTC 

[PATCH v2 0/5] mtd: Microchip 23LCV1024 SPI SRAM
 2026-10-04  4:06 UTC  (6+ messages)
` [PATCH v2 1/5] mtd: refuse an erase on a device that cannot erase
` [PATCH v2 2/5] mtd: align a partition on the write size if the device "
` [PATCH v2 3/5] mtd: add driver for the Microchip 23LCV1024 SPI SRAM
` [PATCH v2 4/5] sandbox: spi: let a slave point at the emulation it needs
` [PATCH v2 5/5] test: dm: add a test for the Microchip 23LCV1024 SPI SRAM

[PATCH v4] riscv: disable local interrupts and stop other CPUs before reboot/shutdown
 2026-10-04  3:46 UTC  (2+ messages)

include/linux/compiler_types.h:702:38: error: call to '__compiletime_assert_432' declared with attribute error: BUILD_BUG_ON failed: fls(LRU_REFS_MAX - 1) > MAX_NR_TIERS - 1
 2026-10-04  4:06 UTC 

drivers/clocksource/timer-mediatek.c:351:(.text+0x297): dangerous relocation: windowed longcall crosses 1GB boundary; return may fail: *UND*
 2026-10-04  4:06 UTC 


This is an external index of several public inboxes,
see mirroring instructions on how to clone and mirror
all data and code used by this external index.