0 day kernel build service
 help / color / mirror / Atom feed
 messages from 2026-09-08 20:40:44 to 2026-09-23 15:12:37 UTC [more...]

arch/x86/coco/sev/core.c:996:69-74: opportunity for str_write_read(write)
 2026-09-23 15:12 UTC 

[paulmckrcu:dev 4/25] drivers/hid/hid-steam.c:557 steam_send_report_id() warn: check sign expansion for '__UNIQUE_ID_x__456'
 2026-09-23 15:11 UTC 

[PATCH v10 2/2] dmaengine: fsl-edma: Support dynamic scatter/gather chaining
 2026-09-23 13:16 UTC 

arch/arm64/boot/dts/rockchip/rk3588-orangepi-5-plus.dtb: hdmi-receiver-cma (shared-dma-pool): Unevaluated properties are not allowed ('alignment', 'alloc-ranges', 'no-map', 'size' were unexpected)
 2026-09-23 12:23 UTC 

[jimc:dyndbg-maple-clean 45/45] lib/dynamic_debug.c:1962 ddebug_reconstruct_site_map() error: double free of 'decompressed_sites' (line 1940)
 2026-09-23  9:47 UTC 

[jimc:m10 35/44] lib/dynamic_debug.c:854 param_set_dyndbg_module_classes() error: we previously assumed 'map' could be null (see line 841)
 2026-09-23  8:37 UTC  (2+ messages)

[linux-next:master 7416/8910] drivers/power/sequencing/pwrseq-kunit.c:248 pwrseq_circular_deps() warn: passing zero to 'PTR_ERR'
 2026-09-23  8:22 UTC 

[linux-next:master 4776/8910] drivers/net/ethernet/xilinx/xilinx_axienet_main.c:2974 axienet_probe() warn: platform_get_irq() does not return zero
 2026-09-23  8:07 UTC  (4+ messages)

[akpm-mm:mm-unstable 425/627] fs/btrfs/extent_io.c:1262 can_skip_one_ordered_range() error: 'folio' dereferencing possible ERR_PTR()
 2026-09-23  7:49 UTC 

[linux-next:master 1917/8910] make[1]: *** No rule to make target 'tools/testing/selftests/filesystems/fuse/test_syncfs', needed by 'all'
 2026-09-23  7:29 UTC 

[linux-next:master 6897/8910] include/linux/device.h:1124 class_device_try_constructor() warn: passing zero to 'ERR_PTR'
 2026-09-23  7:16 UTC 

Documentation/devicetree/bindings/net/allwinner,sun8i-a83t-emac.yaml: properties:syscon:items:0: {'minItems': 1, 'maxItems': 2, 'items': [{'description': 'Phandle to the device containing the EMAC or GMAC clock register'}, {'description': 'Register index 
 2026-09-23  7:06 UTC 

[pci:controller/dwc-rcar-gen4 8/9] Documentation/devicetree/bindings/pci/rcar-gen4-pci-ep.yaml: properties:reset-names: {'minItems': 1, 'maxItems': 2, 'items': [{'const': 'pwr'}, {'const': 'core'}]} should not be valid under {'required': ['maxItems']}
 2026-09-23  6:45 UTC 

[linux-next:master 7149/8910] drivers/gpu/drm/display/drm_hdmi_helper.c:656 drm_connector_hdmi_sync_scdc() warn: variable dereferenced before check 'connector' (see line 650)
 2026-09-23  3:50 UTC 

[pci:controller/dwc-rcar-gen4 7/9] Documentation/devicetree/bindings/pci/rcar-gen4-pci-host.yaml: properties:reset-names: {'minItems': 1, 'maxItems': 2, 'items': [{'const': 'pwr'}, {'const': 'core'}]} should not be valid under {'required': ['maxItems']}
 2026-09-23  3:50 UTC 

[linux-next:master 8362/8910] drivers/hid/hid-steam.c:557 steam_send_report_id() warn: check sign expansion for '__UNIQUE_ID_x__454'
 2026-09-23  3:18 UTC 

[rafael-pm:bleeding-edge 117/144] include/linux/cleanup.h:211:92: warning: suggest braces around empty body in an 'if' statement
 2026-09-23  1:44 UTC 

drivers/gpu/drm/xe/xe_gt_sriov_pf_debugfs.c:310:9: sparse: sparse: an expression is expected before ')'
 2026-09-22 19:36 UTC 

{standard input}:16594: Error: branch out of range
 2026-09-22 14:49 UTC 

drivers/gpu/drm/xe/xe_guc_ads.c:353:9: sparse: sparse: Trying to use reserved word 'if' as identifier
 2026-09-22 14:44 UTC 

lib/raid/xor/xor-neon.c:21:9: sparse: sparse: Trying to use reserved word 'do' as identifier
 2026-09-22  9:17 UTC 

sound/soc/fsl/fsl_easrc.c:57:22: sparse: sparse: unsigned value that used to be signed checked against zero?
 2026-09-22  8:52 UTC 

arch/arm64/boot/dts/rockchip/rk3588-orangepi-5-plus.dtb: hdmi-receiver-cma (shared-dma-pool): Unevaluated properties are not allowed ('alignment', 'alloc-ranges', 'no-map', 'size' were unexpected)
 2026-09-22  6:12 UTC 

arch/riscv/boot/dts/microchip/pic64gx-curiosity-kit.dtb: hss-buffer@bfc00000 (shared-dma-pool): Unevaluated properties are not allowed ('no-map', 'reg' were unexpected)
 2026-09-20  7:24 UTC 

lib/raid/raid6/arm/recov_neon_inner.c:50:9: sparse: sparse: Trying to use reserved word 'while' as identifier
 2026-09-20  4:37 UTC 

drivers/iio/magnetometer/qmc5883l.c:377:8: error: call to '__compiletime_assert_550' declared with 'error' attribute: FIELD_PREP: value too large for the field
 2026-09-19 21:28 UTC 

drivers/pci/endpoint/functions/pci-epf-test.c:769:7-27: WARNING: Threaded IRQ with no primary handler requested without IRQF_ONESHOT (unless it is nested IRQ)
 2026-09-19 13:17 UTC  (3+ messages)

[android-common:android13-5.10 1/1] arch/x86/kernel/static_call.c:19:17: warning: 'tramp_ud' defined but not used
 2026-09-19  8:28 UTC 

include/asm-generic/preempt.h:66:9: sparse: sparse: Trying to use reserved word 'return' as identifier
 2026-09-19  2:55 UTC 

fs/f2fs/checkpoint.o: warning: objtool: __f2fs_add_ino_entry+0x128: unreachable instruction
 2026-09-19  1:19 UTC 

drivers/gpu/drm/i915/display/tests/intel_dp_link_test.c:213:24: sparse: sparse: not a function iter_start
 2026-09-19  1:09 UTC 

arch/arm/include/asm/neon-intrinsics.h:7:2: sparse: sparse: You should compile this file with '-march=armv7-a -mfloat-abi=softfp -mfpu=neon'
 2026-09-18 20:56 UTC 

drivers/gpu/drm/amd/display/dc/dml/dml1_frl_cap_chk.c:506:20-21: WARNING opportunity for max()
 2026-09-18 19:10 UTC 

arch/riscv/kernel/signal.c:196 __restore_cfiss_state() warn: maybe return -EFAULT instead of the bytes remaining?
 2026-09-18 18:19 UTC 

drivers/gpu/drm/i915/display/tests/intel_dp_link_test.c:72:59: sparse: sparse: not a function init
 2026-09-18 17:33 UTC 

[android-common:android14-kiwi-6.1 274/274] load_address.c:81:25: warning: incompatible implicit declaration of built-in function 'strstr'
 2026-09-18 14:45 UTC 

[PATCH net v2 1/1] net: gso: limit recursive IP-in-IP segmentation
 2026-09-18 11:12 UTC 

[linux-next:master 6680/8072] drivers/gpu/drm/i915/display/intel_link_bw.c:69 intel_link_bw_init_limits() error: we previously assumed 'crtc_state' could be null (see line 67)
 2026-09-18  9:31 UTC 

sound/soc/tegra/tegra210_mixer.c:219 tegra210_mixer_put_fade_duration() warn: impossible condition '(duration > 2147483647) => (33-s32max > s32max)'
 2026-09-18  8:59 UTC 

arch/arm/boot/dts/aspeed/aspeed-bmc-facebook-anacapa.dtb: /ahb/apb/lpc@1e789000/lhc@a0: failed to match any schema with compatible: ['aspeed,ast2600-lhc']
 2026-09-18  4:53 UTC 

drivers/gpu/drm/amd/display/dc/hubp/dcn42/dcn42_hubp.c:609:35-36: hubp_program_3dlut_fl_config: first occurrence line 640, second occurrence line 646
 2026-09-18  1:53 UTC 

[akpm-mm:mm-unstable 145/442] drivers/clocksource/timer-atmel-pit.c:261 at91sam926x_pit_dt_init() warn: 'data->base' from of_iomap() not released on lines: 261
 2026-09-17 23:39 UTC 

arch/arm/boot/dts/ti/omap/am335x-sbc-t335.dtb: lcdc@0 (ti,am33xx-tilcdc): 'port' is a required property
 2026-09-17 23:08 UTC 

net/xfrm/xfrm_input.c:839:2-10: WARNING: NULL check before (net)dev_{put, hold} functions is not needed
 2026-09-17 22:48 UTC 

include/asm-generic/bitsperlong.h:23:2: sparse: sparse: Inconsistent word size. Check asm/bitsperlong.h
 2026-09-17 21:29 UTC 

drivers/net/ethernet/pensando/ionic/ionic_txrx.c:204 ionic_rx_build_skb() warn: '(((((((1) << 16)) < ((-1))) ?(((1) << 16)):((-1))) - (18 + 256 + ((((320)) + ((((1 << 7))) - 1)) & ~((((1 << 7))) - 1)))) + 18)' 18446744073709550975 can't fit into 65535 '__
 2026-09-17 18:23 UTC 

drivers/gpu/drm/xe/xe_guc_ads.c:411:9: sparse: sparse: Trying to use reserved word 'return' as identifier
 2026-09-17 17:34 UTC 

drivers/gpu/drm/amd/display/dc/dml2_0/dml21/src/dml2_core/dml2_core_dcn4_calcs.c:6405:53-54: WARNING opportunity for min()
 2026-09-17 17:12 UTC 

[jgunthorpe:mlx5st 5/11] include/arm64/processor.h:194:9: warning: "dma_wmb" redefined
 2026-09-17 17:01 UTC 

[sashal-next:arch-next 19/20] arm64/vgic_its_save.c:289:21: error: too many arguments to function 'vm_phy_pages_alloc'
 2026-09-17 12:47 UTC 

[linux-next:master 1693/7047] security/lsm_audit.c:185:2: error: call to '__compiletime_assert_708' declared with 'error' attribute: BUILD_BUG_ON failed: sizeof(a->u) > sizeof(void *)*2
 2026-09-17 12:40 UTC 

/bin/bash: line 1: 946980 Segmentation fault ld.lld -m elf_x86_64 -mllvm -import-instr-limit=5 --mllvm=-enable-fs-discriminator=true --mllvm=-improved-fs-discriminator=true -plugin-opt=thinlto -plugin-opt=-split-machine-functions -z noexecstack -r -o
 2026-09-17 11:15 UTC 

drivers/gpu/drm/xe/xe_guc_ads.c:411:9: sparse: sparse: Trying to use reserved word 'return' as identifier
 2026-09-17  5:30 UTC 

drivers/gpu/drm/amd/display/dc/dml2_0/dml21/src/dml2_core/dml2_core_dcn4_calcs.c:6405:53-54: WARNING opportunity for min()
 2026-09-17  1:48 UTC 

[tip:sched/core 18/25] include/linux/jump_label.h:262:9: sparse: sparse: Trying to use reserved word 'return' as identifier
 2026-09-16 21:41 UTC 

[PATCH] ARM: dts: helios4: add Wake-on-LAN gpio key
 2026-09-16 13:37 UTC 

[android-common:android16-6.12-lts 1/1] arch/arm64/include/asm/atomic_lse.h:31:26: sparse: sparse: constant integer operation overflow
 2026-09-16 11:29 UTC 

drivers/gpu/drm/amd/display/dc/dml2_0/dml21/src/dml2_core/dml2_core_dcn4_calcs.c:6405:53-54: WARNING opportunity for min()
 2026-09-16 10:11 UTC 

[stefandoesinger-zx297520:dlink 25/132] arch/arm/boot/dts/zte/zx297520v3-dlink-dwr932m.dtb: /soc/spi@140a000: failed to match any schema with compatible: ['zte,zx29-spi']
 2026-09-16  7:59 UTC 

drivers/tty/serial/owl-uart.c:719 owl_uart_probe() warn: 'owl_port->clk' from clk_prepare_enable() not released on lines: 719
 2026-09-16  7:28 UTC 

[dinguyen:socfpga_dts_for_v7.4 5/5] arch/arm64/boot/dts/intel/socfpga_agilex5_socdk_emmc.dtb: /soc@0/mmc@10808000: failed to match any schema with compatible: ['altr,agilex5-sd6hc', 'cdns,sd6hc']
 2026-09-16  7:07 UTC 

arch/riscv/boot/dts/gf/p8700-boston.dtb: /pci@14000000/pci2_root@0,0: failed to match any schema with compatible: ['pci10ee,7021', 'pci-bridge']
 2026-09-16  6:39 UTC 

[spacemit:dt-for-next 6/7] arch/riscv/boot/dts/spacemit/k3-com260-ifx.dtb: /soc/i2c@d4018800/temperature-sensor@4c: failed to match any schema with compatible: ['sensylink,ctf2301']
 2026-09-16  3:42 UTC 

[dinguyen:socfpga_dts_for_v7.4 2/5] arch/arm64/boot/dts/intel/socfpga_agilex5_socdk_nand.dtb: /soc@0/mmc@10808000: failed to match any schema with compatible: ['altr,agilex5-sd6hc', 'cdns,sd6hc']
 2026-09-16  3:21 UTC 

[koverstreet-bcachefs:bcachefs-rebalance_v2 465/799] fs/bcachefs/data/extents.h:551:9: sparse: sparse: unsigned value that used to be signed checked against zero?
 2026-09-15 21:15 UTC 

[akpm-mm:mm-new 502/560] drivers/scsi/sg.c:294:1-17: ERROR: sg_fops: .read() can deadlock .write(); change nonseekable_open -> stream_open to fix
 2026-09-15 14:54 UTC 

[gourryinverse:scratch/gourry/managed_nodes/rfc6-complete 65/67] cram_dropwrite_tool.c:105:13: warning: 'read_ulong_file' defined but not used
 2026-09-15 10:54 UTC 

drivers/gpu/buddy.o: warning: objtool: gpu_buddy_alloc_blocks+0x254: unreachable instruction
 2026-09-15  7:54 UTC 

[PATCH v2] PM: dpm_show_time changes to suspend/resume dmesg prints
 2026-09-15  7:42 UTC 

[gourryinverse:scratch/gourry/managed_nodes/rfc6-complete 64/67] cram_perf_tool.c:301:22: error: implicit declaration of function 'cram_demoted'
 2026-09-15  5:53 UTC 

[gourryinverse:scratch/gourry/managed_nodes/rfc6-complete 64/67] cram_perf_tool.c:293:22: warning: variable 'd1' set but not used
 2026-09-15  5:53 UTC 

drivers/net/wireless/nxp/nxpwifi/cfg80211.c:3401:1-5: alloc with no test, possible model on line 3403
 2026-09-15  5:22 UTC 

[stefandoesinger-zx297520:dlink 26/132] arch/arm/boot/dts/zte/zx297520v3-dlink-dwr932m.dtb: /soc/aon-pin-controller@13c000: failed to match any schema with compatible: ['zte,aux-aon']
 2026-09-15  5:22 UTC 

arch/arm/boot/dts/ti/omap/am335x-sbc-t335.dtb: lcdc@0 (ti,am33xx-tilcdc): 'port' is a required property
 2026-09-15  3:58 UTC 

[android-common:android14-kiwi-6.1 268/268] arch/arm64/kvm/pkvm.c:113:1-25: WARNING: Function "for_each_compatible_node" should have of_node_put() before return around line 119
 2026-09-15  3:26 UTC 

kernel/futex/core.o: warning: objtool: futex_init+0x128: unreachable instruction
 2026-09-15  2:33 UTC 

[phy:next 5/31] drivers/phy/mediatek/phy-mtk-dp.c:334:10: sparse: sparse: missing braces around initializer
 2026-09-14 23:40 UTC 

drivers/gpu/drm/amd/display/dc/hubp/dcn42/dcn42_hubp.c:609:35-36: hubp_program_3dlut_fl_config: first occurrence line 640, second occurrence line 646
 2026-09-14 23:08 UTC 

fs/f2fs/extent_cache.o: warning: objtool: __update_extent_tree_range+0x338: unreachable instruction
 2026-09-14 22:45 UTC 

[sudeep-holla:b4/ffa_ns_sgi_gicv3 2/6] Documentation/devicetree/bindings/interrupt-controller/arm,gic-v3.yaml: properties:arm,secure-donated-ns-sgi-ranges:items:0: 'anyOf' conditional failed, one must be fixed:
 2026-09-14 22:14 UTC 

io_uring/loop.c:50:3-9: preceding lock on line 67
 2026-09-14 19:40 UTC 

arch/arm64/mm/mmu.c:2414:19: error: use of undeclared identifier 'PTVAL_STR_MAX'
 2026-09-14 19:11 UTC 

fs/f2fs/gc.o: warning: objtool: do_garbage_collect+0x2d4: unreachable instruction
 2026-09-14 18:08 UTC 

fs/btrfs/relocation.c:4343:1-7: preceding lock on line 4204
 2026-09-14 17:47 UTC 

[phy:next 5/31] drivers/phy/mediatek/phy-mtk-dp.c:334:10: sparse: sparse: missing braces around initializer
 2026-09-14 16:45 UTC 

[akpm-mm:mm-unstable 385/435] mm/madvise.o: warning: objtool: madvise_collapse+0x60: unreachable instruction
 2026-09-14 15:55 UTC 

drivers/net/wireless/realtek/rtw89/debug.c:4344 rtw89_debug_priv_beacon_info_get() error: buffer overflow 'drift' 32 <= 254
 2026-09-14 15:44 UTC 

drivers/misc/mei/main.c:482:1-7: preceding lock on line 466
 2026-09-14 15:14 UTC 

arch/arm64/mm/fault.c:134:22: error: 'PTVAL_STR_MAX' undeclared
 2026-09-14 14:52 UTC 

drivers/gpu/drm/amd/display/dc/dml2_0/dml21/src/dml2_core/dml2_core_dcn4_calcs.c:6405:53-54: WARNING opportunity for min()
 2026-09-14 14:43 UTC 

mm/show_mem.c:435:4-33: opportunity for str_on_off(mem_alloc_profiling_enabled ( ))
 2026-09-14 12:34 UTC 

fs/btrfs/relocation.c:5080 do_remap_reloc_trans() warn: variable dereferenced before check 'dest_bg' (see line 5014)
 2026-09-14 10:39 UTC 

[stefandoesinger-zx297520:dlink 25/132] arch/arm/boot/dts/zte/zx297520v3-dlink-dwr932m.dtb: /soc/spi@140a000: failed to match any schema with compatible: ['zte,zx29-spi']
 2026-09-14  9:08 UTC 

[kas:collapse/rfc-wip 41/84] mm/swap_state.c:481 __swap_cache_alloc() warn: use 'gfp' here instead of GFP_KERNEL?
 2026-09-14  8:46 UTC 

[android-common:android16-6.12-lts 1/1] arch/arm64/include/asm/atomic_lse.h:31:26: sparse: sparse: constant integer operation overflow
 2026-09-14  7:09 UTC 

kernel/liveupdate/luo_file.c:607:15-23: ERROR: invalid reference to the index variable of the iterator on line 597
 2026-09-14  6:32 UTC 

WARNING: modpost: drivers/char/hw_random/octeon-rng.ko: missing MODULE_DESCRIPTION()
 2026-09-14  4:53 UTC 

[krzk-github:n/dt-bindings-indent-consistent 49/62] Documentation/devicetree/bindings/soc/ti/ti,j721e-system-controller.yaml:118: example 0 [indent-consistent] indent mismatch (expected depth 2 * ' ')
 2026-09-14  2:35 UTC 

Warning: drivers/usb/host/octeon-hcd.c:288 Excess struct member 'flags' description in 'cvmx_usb_transaction'
 2026-09-14  2:34 UTC 

[pci:controller/misc 1/3] drivers/pci/controller/cadence/pcie-cadence-plat.c:103 cdns_plat_pcie_probe() warn: missing unwind goto?
 2026-09-14  2:14 UTC 

Warning: drivers/edac/octeon_edac-pc.c:33 This comment starts with '/**', but isn't a kernel-doc comment. Refer to Documentation/doc-guide/kernel-doc.rst
 2026-09-14  0:00 UTC 

[kas:collapse/rfc-wip 41/84] mm/swap_state.c:481 __swap_cache_alloc() warn: use 'gfp' here instead of GFP_KERNEL?
 2026-09-13 22:32 UTC 

drivers/gpu/drm/amd/display/dc/dml2_0/dml21/src/dml2_core/dml2_core_dcn4_calcs.c:6405:53-54: WARNING opportunity for min()
 2026-09-13 22:01 UTC 

arch/s390/kernel/perf_pai.c:1320:12-13: WARNING opportunity for min()
 2026-09-13 20:48 UTC 

drivers/net/ppp/ppp_synctty.c:469 ppp_sync_txmunge() warn: variable dereferenced before check 'skb' (see line 443)
 2026-09-13 20:27 UTC 

[bpf-next:master 33/40] kernel/bpf/verifier.c:12762:17-18: WARNING opportunity for max()
 2026-09-13 14:35 UTC 

block/blk-mq-dma.o: warning: objtool: blk_rq_map_integrity_sg+0x170: unreachable instruction
 2026-09-13  5:27 UTC 

drivers/gpu/drm/amd/display/dc/dml2_0/dml21/src/dml2_core/dml2_core_dcn4_calcs.c:6405:53-54: WARNING opportunity for min()
 2026-09-13  1:13 UTC 

[martinetd:9p-test 16/18] fs/9p/vfs_addr.c:178 v9fs_init_request() warn: missing unwind goto?
 2026-09-13  1:01 UTC 

Warning: drivers/usb/host/octeon-hcd.c:235 This comment starts with '/**', but isn't a kernel-doc comment. Refer to Documentation/doc-guide/kernel-doc.rst
 2026-09-12 23:50 UTC 

fs/btrfs/raid56.o: warning: objtool: raid56_parity_cache_data_folios+0x78: unreachable instruction
 2026-09-12 23:07 UTC 

[akpm-mm:mm-new 443/459] fs/proc/task_mmu.c:1425 show_smaps_rollup() warn: 'vma' is an error pointer or valid
 2026-09-12 15:24 UTC 

include/net/libeth/xdp.h:1315 libeth_xdp_process_buff() error: we previously assumed 'xdp->data' could be null (see line 1310)
 2026-09-12 15:03 UTC 

[linux-next:master 5126/5916] drivers/hwmon/axiado-tsadc.c:142 axiado_tsadc_raw_to_mc() error: buffer overflow 'axiado_tsadc_table' 34 <= 34
 2026-09-12 14:52 UTC 

drivers/gpu/drm/msm/msm_gem_vma.c:392 msm_gem_vma_new() error: we previously assumed 'obj' could be null (see line 377)
 2026-09-12 14:33 UTC 

[akpm-mm:mm-unstable 381/400] mm/madvise.c:1001 madvise_collapse() warn: variable dereferenced before check 'vma' (see line 969)
 2026-09-12 14:22 UTC 

drivers/platform/x86/toshiba_bluetooth.c:261 toshiba_bt_rfkill_probe() warn: 'bt_dev->rfk' is an error pointer or valid
 2026-09-12 13:01 UTC 

fs/btrfs/extent_io.o: warning: objtool: submit_one_bio+0x44: unreachable instruction
 2026-09-12 12:13 UTC 

[android-common:android16-6.12-lts 1/1] arch/arm64/include/asm/atomic_lse.h:31:26: sparse: sparse: constant integer operation overflow
 2026-09-12  9:28 UTC 

arch/arm/boot/dts/sunplus/sunplus-sp7021-ltpp3g2.dtb: / (tibbo,ltpp3g2): compatible:0: 'tibbo,ltpp3g2' is not one of ['sunplus,sp7021-achip', 'sunplus,sp7021-demo-v3']
 2026-09-12  8:30 UTC 

[asahilinux:bits/080-wifi 39/46] checkpatch: WARNING:BLOCK_COMMENT_STYLE: Block comments should align the * on each line
 2026-09-12  8:20 UTC 

[linusw-nomadik:b4/ux500-simple-sound 22/25] arch/arm/boot/dts/st/ste-href520-tvk.dtb: prcmu@80157000 (stericsson,db8500-prcmu): ab8505:gpio: 'adi1', 'extcpena', 'gpio10', 'gpio11', 'gpio12', 'gpio13', 'gpio16', 'gpio2', 'gpio24', 'gpio25', 'gpio26', 'gpio35', 'gpio36', 'gpio37', 'gpio38', 'gpio39',
 2026-09-12  5:26 UTC 

[PATCH 2/2] arm: sunplus: add Tibbo LTPP3G2 board support; update defconfig
 2026-09-12  4:35 UTC 

[stefandoesinger-zx297520:dlink 25/132] arch/arm/boot/dts/zte/zx297520v3-dlink-dwr932m.dtb: /soc/spi@140a000: failed to match any schema with compatible: ['zte,zx29-spi']
 2026-09-12  0:01 UTC 

arch/arm/boot/dts/ti/omap/am335x-sbc-t335.dtb: lcdc@0 (ti,am33xx-tilcdc): 'port' is a required property
 2026-09-11 23:41 UTC 

Warning: arch/mips/cavium-octeon/executive/cvmx-boot-vector.c:155 This comment starts with '/**', but isn't a kernel-doc comment. Refer to Documentation/doc-guide/kernel-doc.rst
 2026-09-11 22:50 UTC 

Warning: arch/mips/cavium-octeon/octeon-crypto.c:15 This comment starts with '/**', but isn't a kernel-doc comment. Refer to Documentation/doc-guide/kernel-doc.rst
 2026-09-11 20:47 UTC 

drivers/crypto/qce/core.c:294 qce_runtime_suspend() warn: 'qce->bus' from clk_prepare_enable() not released on lines: 291
 2026-09-11 17:35 UTC 

[PATCH] ARM: dts: helios4: add Wake-on-LAN gpio key
 2026-09-11 17:35 UTC 

drivers/dma-buf/st-dma-fence-chain.c:207 test_find_seqno() warn: passing freed memory 'fence' (line 195)
 2026-09-11 16:26 UTC  (5+ messages)

[soc:board-remove-7.3 182/295] drivers/hwmon/ads7828.c:121 ads7828_probe() warn: if statement not indented
 2026-09-11 15:48 UTC  (3+ messages)

[soc:board-remove-7.3 182/295] drivers/hwmon/ads7828.c:121 ads7828_probe() warn: if statement not indented
 2026-09-11 14:33 UTC 

/bin/bash: line 1: 1447177 Segmentation fault clang -Wp,-MMD,drivers/iio/humidity/.hdc3020.o.d -nostdinc -Iarch/mips/include -I./arch/mips/include/generated -Iinclude -I./include -Iarch/mips/include/uapi -I./arch/mips/include/generated/uapi -Iinclude
 2026-09-11 13:54 UTC 

drivers/usb/typec/hd3ss3220.c:221:37-39: opportunity for str_enable_disable(on)
 2026-09-11 13:42 UTC 

[stefandoesinger-zx297520:dlink 25/132] arch/arm/boot/dts/zte/zx297520v3-dlink-dwr932m.dtb: /soc/spi@140a000: failed to match any schema with compatible: ['zte,zx29-spi']
 2026-09-11 10:49 UTC 

[stefandoesinger-zx297520:dlink 25/132] arch/arm/boot/dts/zte/zx297520v3-dlink-dwr932m.dtb: /soc/spi@140a000: failed to match any schema with compatible: ['zte,zx29-spi']
 2026-09-11 10:49 UTC 

[android-common:android16-6.12-lts 1/1] arch/arm64/include/asm/atomic_lse.h:31:26: sparse: sparse: constant integer operation overflow
 2026-09-11 10:22 UTC 

include/net/libeth/xdp.h:1315 libeth_xdp_process_buff() error: we previously assumed 'xdp->data' could be null (see line 1310)
 2026-09-11 10:16 UTC 

drivers/pci/probe.c:1891:12: warning: unused variable 'rev'
 2026-09-11  9:07 UTC 

drivers/hwmon/pmbus/tda38740.c:65:1: warning: control reaches end of non-void function
 2026-09-11  8:10 UTC 

lib/assoc_array.o: error: objtool: assoc_array_insert_into_terminal_node+0x41c: can't find jump dest instruction at .text.assoc_array_insert_into_terminal_node+0x9d4
 2026-09-11  5:43 UTC 

drivers/hwmon/pmbus/tda38740.c:58:42: error: invalid application of 'sizeof' to an incomplete type 'struct tda38740_data'
 2026-09-11  4:46 UTC 

drivers/hwmon/pmbus/tda38740.c:58:49: error: invalid application of 'sizeof' to incomplete type 'struct tda38740_data'
 2026-09-11  3:39 UTC 

Warning: drivers/power/supply/bq257xx_charger.c:90 struct member 'dev' not described in 'bq257xx_chg'
 2026-09-11  2:31 UTC 

[PATCH 2/2] arm: sunplus: add Tibbo LTPP3G2 board support; update defconfig
 2026-09-10 22:58 UTC 

arch/arm/boot/dts/ti/omap/am335x-sbc-t335.dtb: lcdc@0 (ti,am33xx-tilcdc): 'port' is a required property
 2026-09-10 19:25 UTC 

[paulmck-rcu:non-rcu/next 30/41] drivers/hid/hid-steam.c:557 steam_send_report_id() warn: check sign expansion for '__UNIQUE_ID_x__463'
 2026-09-10 18:08 UTC 

lib/raid/raid6/powerpc/vpermxor1.c:29:16: sparse: sparse: two or more data types in declaration specifiers
 2026-09-10 17:41 UTC 

arch/arm64/boot/dts/freescale/imx8mp-skov-revc-jutouch-jt101tm023.dtb: / (skov,imx8mp-skov-revc-jutouch-jt101tm023): compatible: 'oneOf' conditional failed, one must be fixed:
 2026-09-10 15:42 UTC 

arch/arm64/boot/dts/freescale/imx8mp-skov-revc-jutouch-jt070tm041.dtb: / (skov,imx8mp-skov-revc-jutouch-jt070tm041): compatible: 'oneOf' conditional failed, one must be fixed:
 2026-09-10 15:42 UTC 

[PATCH 2/2] arm64: dts: allwinner: orangepi-zero3: enable HDMI output
 2026-09-10 15:40 UTC 

arch/arm64/boot/dts/qcom/purwa-iot-evk.dtb: psci (arm,psci-1.0): 'reboot-mode' does not match any of the regexes: '^pinctrl-[0-9]+$', '^power-domain-'
 2026-09-10 15:40 UTC 

arch/arm64/boot/dts/nvidia/tegra210-p3541-0000.dtb: /pcie@1003000: failed to match any schema with compatible: ['nvidia,tegra210-pcie']
 2026-09-10 15:40 UTC 

[PATCH 2/2] arm64: dts: allwinner: orangepi-zero3: enable HDMI output
 2026-09-10 15:39 UTC 

[spacemit-com:wip/k3-pm-v2 3/4] arch/riscv/boot/dts/spacemit/k1-musepi-pro.dtb: /power-controller: failed to match any schema with compatible: ['spacemit,k1-power-controller']
 2026-09-10 15:39 UTC 

arch/arm64/boot/dts/mediatek/mt8395-genio-1200-evk-ufs.dtb: infra-iommu@10315000 (mediatek,mt8195-iommu-infra): interrupts: [[0, 795, 4, 0], [0, 796, 4, 0], [0, 797, 4, 0], [0, 798, 4, 0], [0, 799, 4, 0]] is too long
 2026-09-10 15:39 UTC 

[PATCH v3 2/2] arm64: dts: qcom: purwa: Add PSCI SYSTEM_RESET2 types
 2026-09-10 15:39 UTC 

drivers/gpu/drm/msm/msm_gem_vma.c:392 msm_gem_vma_new() error: we previously assumed 'obj' could be null (see line 377)
 2026-09-10 14:47 UTC 

[paulmckrcu:dev 11/55] drivers/hid/hid-steam.c:557 steam_send_report_id() warn: check sign expansion for '__UNIQUE_ID_x__466'
 2026-09-10 14:26 UTC 

[linux-next:master 1145/4316] sound/soc/codecs/nau8360-dsp.c:214 nau8360_message_to_dsp() warn: missing error code? 'ret'
 2026-09-10 14:20 UTC  (2+ messages)

[android-common:android-mainline 12/12] drivers/clocksource/timer-pxa.c:174 pxa_timer_common_init() warn: 'irq' from request_irq() not released on lines: 168
 2026-09-10 10:48 UTC 

[android-common:android-mainline 12/12] fs/incfs/vfs.c:1129 dir_mkdir() warn: passing zero to 'ERR_PTR'
 2026-09-10  9:58 UTC 

drivers/gpu/drm/xlnx/zynqmp_dpsub.c:114 zynqmp_dpsub_init_clocks() warn: 'dpsub->apb_clk' from clk_prepare_enable() not released on lines: 85,91
 2026-09-10  9:28 UTC 

arch/x86/kvm/vmx/hyperv_evmcs.h:133:30: sparse: sparse: cast truncates bits from constant value (1b069b becomes 69b)
 2026-09-10  7:40 UTC 

net/wireless/nl80211.c:19576:7: error: use of undeclared identifier 'n_dl_tids'
 2026-09-10  1:05 UTC 

[axboe:io_uring-thread-handoff.2 11/15] io_uring/io_uring.c:2828 __do_sys_io_uring_enter() warn: inconsistent returns '&ctx->uring_lock'
 2026-09-09 23:37 UTC 

arch/x86/kvm/svm/svm.c:5344:2: error: cannot jump from switch statement to this case label
 2026-09-09 22:53 UTC 

[axboe:io_uring-exit-cancel.4 6/7] build_policy.c:(.text+0x7c9f): dangerous relocation: l32r: literal target out of range (try using text-section-literals): (.text+0x7c88)
 2026-09-09 21:07 UTC 

[linux-next:master 4387/5391] fs/ntfs/mft.c:1065 mft_bitmap_alloc_free_rec() warn: mask and shift to zero: expr='bit >> 3'
 2026-09-09 20:54 UTC 

[linux-next:master 208/5391] drivers/gpu/drm/xe/xe_guc_pc.c:1254:9: sparse: sparse: Trying to use reserved word 'return' as identifier
 2026-09-09 20:42 UTC 

[frank-w-bpi-r2-4.14:7.2-main 213/213] drivers/tty/serial/8250/8250_mtk.c:437 mtk8250_runtime_suspend() warn: test_and_clear_bit() takes a bit number
 2026-09-09 19:48 UTC  (2+ messages)

include/net/mac80211.h:8285:26: error: 'SKB_EXT_WIRELESS' undeclared
 2026-09-09 19:28 UTC 

net/wireless/nl80211.c:19576:14: error: 'n_dl_tids' undeclared
 2026-09-09 19:28 UTC 

[PATCH v6] PCI/pcie: Add PCIe Lane Margining at Receiver (LMR) support
 2026-09-09 17:37 UTC  (3+ messages)

arch/arm/boot/dts/aspeed/aspeed-bmc-asrock-b650d4u.dtb: /ahb/apb/lpc@1e789000/lhc@a0: failed to match any schema with compatible: ['aspeed,ast2600-lhc']
 2026-09-09 12:44 UTC 

arch/arm64/boot/dts/nvidia/tegra210-p3541-0000.dtb: /pcie@1003000: failed to match any schema with compatible: ['nvidia,tegra210-pcie']
 2026-09-09 11:53 UTC 

drivers/infiniband/hw/mlx5/devx.c:2544 deliver_event() error: __builtin_memcpy() 'event_data->hdr.out_data' too small (8 vs 64)
 2026-09-09 11:48 UTC 

drivers/mtd/nand/raw/cadence-nand-controller.c:2956 cadence_nand_init() warn: variable dereferenced before check 'cdns_ctrl->dmac' (see line 2918)
 2026-09-09 11:36 UTC  (2+ messages)

[RFC PATCH v2] vhost: coalesce and retry IOTLB miss messages
 2026-09-09 10:32 UTC  (2+ messages)

arch/arm64/boot/dts/mediatek/mt8395-genio-1200-evk-ufs.dtb: infra-iommu@10315000 (mediatek,mt8195-iommu-infra): interrupts: [[0, 795, 4, 0], [0, 796, 4, 0], [0, 797, 4, 0], [0, 798, 4, 0], [0, 799, 4, 0]] is too long
 2026-09-09  7:00 UTC 

[frank-li:imx/dt64 52/52] arch/arm64/boot/dts/freescale/imx952-evk-mqs.dtb: opp-500000000: opp-hz-real: b'\x00\x00\x00\x00\x1d\xcde\x00' is not of type 'object', 'integer', 'array', 'boolean', 'null'
 2026-09-09  5:28 UTC 

[PATCH v4] MAINTAINERS: Add Qualcomm QAIF driver entry
 2026-09-09  4:57 UTC 

drivers/gpu/drm/msm/msm_gem_vma.c:392 msm_gem_vma_new() error: we previously assumed 'obj' could be null (see line 377)
 2026-09-09  0:55 UTC 

arch/arm64/boot/dts/broadcom/bcm2712-d-rpi-5-b.dtb: hvs@107c580000 (brcm,bcm2712-hvs): 'iommus' does not match any of the regexes: '^pinctrl-[0-9]+$'
 2026-09-09  0:13 UTC 

arch/s390/kvm/s390/interrupt.c:1282 kvm_s390_handle_wait() warn: shift has higher precedence than mask 'gisa_get_ipm_or_restore_iam(gi)' & 'vcpu->arch.sie_block->gcr[6] >> 24'
 2026-09-08 23:07 UTC 

[rclaveau:b4/add-adla_npu-t7-vim4 12/12] arch/arm64/boot/dts/amlogic/amlogic-t7-a311d2-an400.dtb: soc (simple-bus): 'adla@0xfe371000' does not match any of the regexes: '.*-names$', '.*-supply$', '^#.*-cells$', '^#[a-zA-Z0-9,+\\-._]{0,63}$', '^[a-zA-Z0-9][a-zA-Z0-9#,+\\-._]{0,63}$', '^[a-zA-Z0-9
 2026-09-08 23:02 UTC 

[intel-lts:6.18/linux 1/1] unix_listen.c:26:10: fatal error: kselftest_harness.h: No such file or directory
 2026-09-08 20:39 UTC 


This is a public inbox, see mirroring instructions
for how to clone and mirror all data and code used for this inbox