messages from 2026-09-17 05:30:49 to 2026-09-30 10:34:39 UTC [more...]
[qcom:clk-for-7.4 40/149] arch/arm64/boot/dts/qcom/sdm670-google-bonito-tianma.dtb: clock-controller@100000 (qcom,gcc-sdm670): 'power-domains' is a required property
2026-09-30 10:33 UTC
[qcom:arm64-for-7.4 118/291] arch/arm64/boot/dts/qcom/nord-rrd.dtb: pinctrl@f100000 (qcom,nord-tlmm): qup-i2c9-default-state: 'oneOf' conditional failed, one must be fixed:
2026-09-30 8:41 UTC
[jpirko-mlxsw:wip_attestation_pre_rfc_draft1 17/26] ctlv.c:1740:52: warning: format '%llu' expects argument of type 'long long unsigned int', but argument 5 has type '__u64' {aka 'long unsigned int'}
2026-09-30 7:50 UTC
[geert-renesas-drivers:master 6/75] arch/arm64/boot/dts/renesas/r9a07g044l2-hummingboard-iiot.dtb: hub@1 (usb4b4,6502): 'peer-hub' is a required property
2026-09-30 6:57 UTC
[broadcom-stblinux:devicetree-arm64/next 10/10] arch/arm64/boot/dts/broadcom/bcm2712-rpi-5-b.dtb: /axi/iommu@1000005200: failed to match any schema with compatible: ['brcm,bcm2712-iommu']
2026-09-30 6:57 UTC
[clk:clk-pile 38/39] arch/riscv/boot/dts/anlogic/dr1v90-mlkpai-fs01.dtb: clock-ext-can (fixed-clock): 'clock-frequency' is a required property
2026-09-30 5:25 UTC
robust_list.c:56:9: error: redeclaration of enumerator 'FUTEX_ROBUST_LIST_CMD_CREATE_64'
2026-09-30 3:23 UTC
[qcom:arm64-for-7.4 235/291] arch/arm64/boot/dts/qcom/hamoa-advantech-som-db5830.dtb: phy@fd5000 (qcom,x1e80100-qmp-usb3-dp-phy): clock-names: ['aux', 'ref', 'com_aux', 'usb3_pipe', 'p2rr2p_pipe'] is too long
2026-09-30 1:40 UTC
[broadcom-stblinux:devicetree-arm64/next 9/10] arch/arm64/boot/dts/broadcom/bcm2712-rpi-5-b.dtb: /axi/pcie@1000120000/pci@0,0/dev@0,0/pci-ep-bus@1/pwm@4009c000: failed to match any schema with compatible: ['raspberrypi,rp1-pwm']
2026-09-29 23:16 UTC
drivers/clocksource/timer-fsl-ftm.c:258 __ftm_clk_init() warn: 'clk' from clk_prepare_enable() not released on lines: 251
2026-09-29 22:56 UTC
[frank-li:imx/dt64 65/103] arch/arm64/boot/dts/freescale/fsl-lx2160a-nbxv3.dtb: gpio@2310000 (fsl,ls2080a-gpio): 'pltrst-hog' does not match any of the regexes: '^pinctrl-[0-9]+$'
2026-09-29 19:48 UTC (2+ messages)
drivers/net/dsa/motorcomm/chip.c:4500:2: warning: variable 'ctrl' is uninitialized when used here
2026-09-29 19:12 UTC
drivers/scsi/imm.c:1249 __imm_attach() warn: '&dev->list' not removed from list
2026-09-29 17:04 UTC
drivers/net/dsa/motorcomm/chip.c:3928:29: error: use of undeclared identifier 'priv'
2026-09-29 12:35 UTC
[qcom:clk-for-7.4 41/147] arch/arm64/boot/dts/qcom/sm8150-mtp.dtb: clock-controller@100000 (qcom,gcc-sm8150): 'power-domains' is a required property
2026-09-29 11:43 UTC
cfi_probe.c:(.xiptext+0x18e): dangerous relocation: windowed longcall crosses 1GB boundary; return may fail: ftrace_likely_update
2026-09-29 7:59 UTC
[android-common:android17-6.18-kminext 1/1] futex_numa_mpol.c:134:13: warning: 'test_futex_mpol' defined but not used
2026-09-29 6:18 UTC
[android-common:android16-6.12-kminext 7/7] kernel/cgroup/cgroup.c:5863 cgroup_create() warn: passing zero to 'ERR_PTR'
2026-09-29 6:12 UTC (2+ messages)
lib/raid/raid6/arm/recov_neon_inner.c:23:9: sparse: sparse: Trying to use reserved word 'return' as identifier
2026-09-29 3:23 UTC
[PATCH v4] ACPI: button: Report wakeup key only for power button wakeups
2026-09-29 2:52 UTC
net: ethtool: add BaseC2C medium & AUI C2C link modes
2026-09-29 0:11 UTC
[linux-next:master 6294/10910] sound/soc/sof/amd/acp.c:1469 handle_amd_sof_acp7x_sdw_pme_event() error: buffer overflow 'adata->sdw->pdev' 2 <= 3
2026-09-28 19:49 UTC (5+ messages)
[jic23-iio:testing 66/82] drivers/iio/magnetometer/ak8975.c:627 ak8975_setup() warn: passing zero to 'dev_err_probe'
2026-09-28 16:38 UTC (3+ messages)
sound/i2c/tea6330t.c:387:12-13: WARNING opportunity for min()
2026-09-28 14:33 UTC
[akpm-mm:mm-unstable 462/660] drivers/hid/hid-steam.c:557 steam_send_report_id() warn: check sign expansion for '__UNIQUE_ID_x__441'
2026-09-28 13:21 UTC
net/sunrpc/backchannel_rqst.c:249:2-31: opportunity for str_true_false(list_empty ( & xprt -> bc_pa_list ))
2026-09-28 12:07 UTC
drivers/regulator/pf0900-regulator.c:891:7-32: WARNING: Threaded IRQ with no primary handler requested without IRQF_ONESHOT (unless it is nested IRQ)
2026-09-28 9:11 UTC
[qcom:arm64-for-7.4 105/196] arch/arm64/boot/dts/qcom/x1e80100-honor-magicbook-art-14.dtb: phy@fd5000 (qcom,x1e80100-qmp-usb3-dp-phy): clock-names: ['aux', 'ref', 'com_aux', 'usb3_pipe', 'p2rr2p_pipe'] is too long
2026-09-28 7:49 UTC
[linusw-nomadik:ux500-dts-for-soc 3/9] arch/arm/boot/dts/st/ste-ux500-samsung-janice.dtb: janice_cfg1: ste,config: b'\x00\x00\x00(' is not of type 'object', 'integer', 'array', 'boolean', 'null'
2026-09-28 3:56 UTC
[qcom:clk-for-7.4 40/142] arch/arm64/boot/dts/qcom/sdm670-google-bonito-tianma.dtb: clock-controller@100000 (qcom,gcc-sdm670): 'power-domains' is a required property
2026-09-28 3:25 UTC
[net-next:main 1/49] ERROR: modpost: __ex_table+0x2230 references non-executable section '.rodata.cst4'
2026-09-28 2:04 UTC
[qcom:arm64-for-7.4 125/229] arch/arm64/boot/dts/qcom/hawi-mtp.dtb: remoteproc@4000000 (qcom,hawi-mpss-pas): compatible: 'oneOf' conditional failed, one must be fixed:
2026-09-28 1:23 UTC
arch/arm64/boot/dts/qcom/purwa-iot-evk-edp.dtb: phy@fd5000 (qcom,x1e80100-qmp-usb3-dp-phy): clock-names: ['aux', 'ref', 'com_aux', 'usb3_pipe', 'p2rr2p_pipe'] is too long
2026-09-28 1:02 UTC
[linux-next:master 5544/10910] drivers/net/ethernet/freescale/enetc/enetc_vf.c:575:7-15: opportunity for str_on_off(tx_pause)
2026-09-27 17:33 UTC
[mm:staging/for-test 6/7] drivers/hid/hid-steam.c:557 steam_send_report_id() warn: check sign expansion for '__UNIQUE_ID_x__478'
2026-09-27 15:50 UTC
[PATCH v3 2/2] arm64: dts: qcom: purwa-iot-evk: Add eDP display overlay
2026-09-27 13:35 UTC
kernel/trace/trace.c:6382:27-28: ERROR: invalid reference to the index variable of the iterator on line 6308
2026-09-27 12:02 UTC
[android-common:android12-kiwi-5.10 284/284] userfaultfd.c:146:33: warning: format '%d' expects a matching 'int' argument
2026-09-27 12:02 UTC
[dhowells-fs:netfs-next-3 21/26] fs/netfs/iterator.c:138:26-35: WARNING: Unsigned expression compared with zero: max_pages > 0
2026-09-27 11:31 UTC
[linux-next:master 6292/10910] sound/soc/sof/amd/acp.c:663 sof_amd_handle_acp7x_sdw_wake_event() error: buffer overflow 'adata->sdw->pdev' 2 <= 3
2026-09-27 10:08 UTC
[gourryinverse:scratch/gourry/managed_nodes/rfc6-nonuma 43/51] cram_perf_tool.c:289:13: error: implicit declaration of function 'cram_pageout'
2026-09-27 10:08 UTC
[android-common:android12-kiwi-5.10 284/284] userfaultfd.c:374:13: warning: 'uffd_test_ctx_clear' defined but not used
2026-09-27 8:13 UTC
[linux-next:master 5319/10910] drivers/net/ethernet/airoha/airoha_eth.c:513 airoha_fe_lro_rxq_enable() warn: subtract is higher precedence than shift
2026-09-27 5:41 UTC
[akpm-mm:mm-unstable 461/655] drivers/hid/hid-steam.c:557 steam_send_report_id() warn: check sign expansion for '__UNIQUE_ID_x__431'
2026-09-27 4:42 UTC
[android-common:android12-kiwi-5.10 284/284] util/stat-shadow.c:359:55: error: 'calloc' sizes specified with 'sizeof' in the earlier argument and not in the later argument
2026-09-26 21:55 UTC
[android-common:android12-kiwi-5.10 284/284] userfaultfd.c:373:63: warning: spurious trailing '%' in format
2026-09-26 21:44 UTC
kernel/trace/trace.c:6382:27-28: ERROR: invalid reference to the index variable of the iterator on line 6308
2026-09-26 19:50 UTC
[peterz-queue:sched/task_h_load 14/14] kernel/sched/fair.c:8250 enqueue_hierarchy() warn: was '== 0' instead of '='
2026-09-26 19:50 UTC
[linux-next:master 466/10910] ERROR: modpost: __ex_table+0x15c0 references non-executable section '.data.rel.ro'
2026-09-26 19:02 UTC
[PATCH v3 2/2] arm64: dts: qcom: purwa-iot-evk: Add eDP display overlay
2026-09-26 18:28 UTC
[qcom:arm64-for-7.4 96/196] arch/arm64/boot/dts/qcom/glymur-asus-zenbook-a14-ux3407na.dtb: aop-cmd-db@81c60000 (qcom,cmd-db): Unevaluated properties are not allowed ('no-map', 'reg' were unexpected)
2026-09-26 17:47 UTC
[gerg-m68knommu:dt 2/22] drivers/tty/serial/mcf.c:586:25: sparse: sparse: unsigned value that used to be signed checked against zero?
2026-09-26 15:19 UTC
arch/arm64/boot/dts/mediatek/mt8195-evb.dtb: ufshci@11270000 (mediatek,mt8195-ufshci): clock-names: ['ufs', 'ufs_aes', 'ufs_tick', 'unipro_sysclk', 'unipro_tick', 'unipro_mp_bclk', 'ufs_tx_symbol', 'ufs_mem_sub'] is too short
2026-09-26 13:18 UTC
kernel/trace/trace.c:6382:27-28: ERROR: invalid reference to the index variable of the iterator on line 6308
2026-09-26 12:16 UTC
[linux-next:master 6692/10910] ERROR: modpost: __ex_table+0x18d8 references non-executable section '.data.rel.local'
2026-09-26 12:02 UTC
[arnd-playground:randconfig-7.3-next 562/673] drivers/tty/serial/8250/8250_dw.c:591 dw8250_quirks() warn: if statement not indented
2026-09-26 8:31 UTC (2+ messages)
[arnd-playground:randconfig-7.3-next 539/673] drivers/tty/serial/serial_port.c:247 __uart_read_properties() warn: if statement not indented
2026-09-26 8:30 UTC (2+ messages)
drivers/media/virtio/scatterlist_builder.c:170:8: error: assigning to 'void *' from 'const void *' discards qualifiers
2026-09-26 7:07 UTC
[superna9999:topic/sm8650/deckard-chassis-type 5/5] arch/arm64/boot/dts/qcom/sm8650-valve-deckard.dtb: / (valve,deckard): chassis-type:0: 'headset' is not one of ['desktop', 'laptop', 'convertible', 'server', 'all-in-one', 'tablet', 'handheld', 'handset', 'watch', 'embedded', 'television', 'spectacles']
2026-09-26 5:28 UTC
[linux-next:master 1914/8413] ERROR: modpost: __ex_table+0x18e4 references non-executable section '.rodata'
2026-09-26 4:25 UTC
drivers/rtc/rtc-pic32.c:249:41-47: opportunity for str_yes_no(repeat)
2026-09-26 3:03 UTC
[arnd-playground:randconfig-7.3-next 428/673] mm/mmap.c:630 __do_sys_mmap2() warn: bitwise AND condition is false here
2026-09-26 0:58 UTC
drivers/net/can/dummy_can.c:135:7-25: opportunity for str_on_off(enabled & BIT ( idx ))
2026-09-26 0:48 UTC
[frank-w-bpi-r2-4.14:7.2-main 214/214] drivers/net/phy/phylink.c:1025:32-35: ERROR: invalid reference to the index variable of the iterator on line 1014
2026-09-25 23:15 UTC
arch/arm64/boot/dts/rockchip/rk3588-orangepi-5-plus.dtb: hdmi-receiver-cma (shared-dma-pool): Unevaluated properties are not allowed ('alignment', 'alloc-ranges', 'no-map', 'size' were unexpected)
2026-09-25 23:15 UTC
arch/arm/boot/dts/nvidia/tegra20-asus-sl101.dtb: linux,cma@30000000 (shared-dma-pool): Unevaluated properties are not allowed ('alloc-ranges', 'reusable', 'size' were unexpected)
2026-09-25 23:03 UTC
arch/arm64/boot/dts/qcom/purwa-iot-evk-edp.dtb: aop-cmd-db@81c60000 (qcom,cmd-db): Unevaluated properties are not allowed ('no-map', 'reg' were unexpected)
2026-09-25 22:37 UTC
drivers/dma-buf/st-dma-fence-unwrap.c:78:39-45: ERROR: reference preceded by free on line 73
2026-09-25 21:46 UTC
drivers/gpu/drm/tiny/ch1115-i2c.c:493:10: error: 'const struct drm_crtc_funcs' has no member named 'reset'
2026-09-25 21:44 UTC
[linusw-nomadik:ux500-dts-for-soc 3/9] arch/arm/boot/dts/st/ste-ux500-samsung-janice.dtb: janice_cfg1: ste,config: b'\x00\x00\x00(' is not of type 'object', 'integer', 'array', 'boolean', 'null'
2026-09-25 21:08 UTC
[arnd-playground:randconfig-7.3-next 448/673] fs/exfat/file.c:606:6: warning: stack frame size (820) exceeds limit (768) in 'exfat_ioctl'
2026-09-25 20:37 UTC
drivers/gpu/drm/tiny/ch1115-i2c.c:493:11: error: use of undeclared identifier 'drm_atomic_helper_crtc_reset'; did you mean 'drm_atomic_helper_check_modeset'?
2026-09-25 17:47 UTC
[geert-renesas-drivers:topic/rcar-x5h-ironhide-scmi-cpg-mdlc-remapping-v4-wip 4/85] arch/arm64/boot/dts/renesas/r9a09g077m44-rzt2h-evk.dtb: adc@90014000 (renesas,r9a09g077-adc): interrupt-names: ['adi', 'gbadi', 'gcadi', 'cmpai', 'cmpbi'] is too short
2026-09-25 17:42 UTC
[PATCH] platform/x86: bitland-mifs-wmi: Support WUJIE15 PRO HPT
2026-09-25 16:40 UTC
[krzk:next/dt64 21/22] arch/arm64/boot/dts/exynos/exynos850-a217f.dtb: /soc@0/sram@2039000: failed to match any schema with compatible: ['samsung,exynos850-acpm-sram']
2026-09-25 13:23 UTC
[arnd-playground:randconfig-7.3-next 448/673] fs/exfat/file.c:575:1: warning: the frame size of 788 bytes is larger than 768 bytes
2026-09-25 13:12 UTC
[arnd-playground:randconfig-7.3-next 448/673] arch/um/os-Linux/sigio.c:301:13: warning: stack frame size (828) exceeds limit (768) in 'os_check_bugs'
2026-09-25 10:14 UTC
[RFC PATCH] panic, printk, sys_info: Introduce crash_kexec_in_memory_sys_info
2026-09-25 9:36 UTC
[gourryinverse:scratch/gourry/managed_nodes/rfc6 33/41] mm/page_alloc.c:4046 __alloc_pages_may_oom() warn: bitwise AND condition is false here
2026-09-25 8:44 UTC
[PATCH v3 2/2] arm64: dts: qcom: purwa-iot-evk: Add eDP display overlay
2026-09-25 7:43 UTC
drivers/xen/gntdev.c:817 gntdev_get_page() warn: mask and shift to zero: expr='(addr & ~(~((1 << 12) - 1))) >> 12'
2026-09-25 7:42 UTC (4+ messages)
[perf-tools-next:tmp.perf-tools-next 63/112] ./linux/mm.h:112:21: error: conflicting types for 'kmalloc'; have 'void *(unsigned int, unsigned int)'
2026-09-25 1:27 UTC
[linux-next:master 7223/10113] drivers/iio/dac/mcp47feb02.c:1027 mcp47feb02_init_ctrl_regs() warn: subtract is higher precedence than shift
2026-09-24 23:44 UTC
[lee-mfd:for-mfd-next 35/35] arch/arm/boot/dts/ti/keystone/keystone-k2e-evm.dtb: device-state-control@2620000 (ti,keystone-devctrl): 'keystone_dsp_gpio@240', 'keystone_irq@2a0' do not match any of the regexes: '^gpio@[0-9a-f]+$', '^interrupt-controller@[0-9a-f]+$', '^pinctrl-[0-9]+$'
2026-09-24 23:24 UTC
[linux-next:master 9787/10113] kernel/bpf/verifier.c:6753 check_func_ptr_read() warn: missing unwind goto?
2026-09-24 23:13 UTC
[nolibc:for-next 12/14] ./../../../../include/nolibc/types.h:122:39: warning: 'status' may be used uninitialized
2026-09-24 22:52 UTC
[intel-tdx:v7.3-rc4_tdx_connect_phase2.for_upstream 11/44] drivers/pci/tsm/core.c:589 pci_tsm_accept() warn: set_bit() takes a bit number
2026-09-24 19:34 UTC (2+ messages)
Re:
2026-09-24 19:10 UTC
drivers/media/virtio/virtio_media_driver.c:670:33: sparse: sparse: incorrect type in assignment (different base types)
2026-09-24 18:47 UTC
[intel-tdx:v7.3-rc4_tdx_connect_phase2.for_upstream 12/44] drivers/pci/tsm/core.c:777 pci_tsm_enable_dma() warn: set_bit() takes a bit number
2026-09-24 18:07 UTC
mm/memcontrol.c:3324 drain_obj_stock_slot() warn: right shifting more than type allows 16 vs 16
2026-09-24 17:25 UTC
arch/arm64/boot/dts/rockchip/rk3588-orangepi-5-plus.dtb: hdmi-receiver-cma (shared-dma-pool): Unevaluated properties are not allowed ('alignment', 'alloc-ranges', 'no-map', 'size' were unexpected)
2026-09-24 17:05 UTC
drivers/media/virtio/scatterlist_builder.c:196:28: sparse: sparse: incorrect type in assignment (different base types)
2026-09-24 16:40 UTC
[linux-next:master 163/8910] drivers/gpu/drm/xe/xe_guc_pc.c:1400:17: sparse: sparse: Trying to use reserved word 'typeof' as identifier
2026-09-24 16:29 UTC
[geert-renesas-devel:renesas-dts-for-v7.4 64/75] arch/arm64/boot/dts/renesas/r9a09g087m44-rzn2h-evk.dtb: adc@90014000 (renesas,r9a09g087-adc): 'dma-names', 'dmas' do not match any of the regexes: '^channel@[0-9a-f]$', '^pinctrl-[0-9]+$'
2026-09-24 15:31 UTC
[bvanassche:scsi-thread-safety 59/61] drivers/scsi/BusLogic.c:3102:8: warning: calling function 'blogic_qcmd_lck' requires holding spinlock 'command->device->host->host_lock' exclusively
2026-09-24 15:24 UTC
lib/crc/crc64-neon.c:22 crc64_nvme_neon() warn: statement has no effect 'uint64x2_t'
2026-09-24 15:21 UTC
drivers/media/virtio/virtio_media_driver.c:135:28: sparse: sparse: incorrect type in assignment (different base types)
2026-09-24 15:13 UTC
arch/arm64/boot/dts/allwinner/sun55i-h728-x96qpro+.dtb: clock-controller@8817000 (allwinner,sun55i-a523-cpu-ccu): clock-names:4: 'pll-periph0-600m' was expected
2026-09-24 14:50 UTC
[PATCH v1] arm64: dts: ti: k3-am62p5-verdin: build zinnia dtbs
2026-09-24 12:50 UTC (3+ messages)
[linux-next:master 8364/9480] fs/smb/client/transport.c:1118 compound_send_recv() error: we previously assumed 'resp_iov' could be null (see line 1094)
2026-09-24 12:27 UTC
drivers/firmware/arm_scmi/notify.c:942 scmi_bind_event_handler() warn: subtract is higher precedence than shift
2026-09-24 10:04 UTC
sound/soc/cdns/cdns-i2s-mc.c:221:21: error: implicit declaration of function 'FIELD_PREP'
2026-09-24 10:01 UTC
[linux-next:master 5416/9480] drivers/memory/tegra/tegra264.c:964:7-28: opportunity for str_write_read(value & fault -> rw_bit)
2026-09-24 7:23 UTC
arch/xtensa/include/asm/cmpxchg.h:88:58: warning: pointer type mismatch in conditional expression
2026-09-24 6:33 UTC
kernel/trace/trace.c:6382:27-28: ERROR: invalid reference to the index variable of the iterator on line 6308
2026-09-24 6:21 UTC
sound/soc/cdns/cdns-i2s-sc.c:232:9: error: call to undeclared function 'FIELD_PREP'; ISO C99 and later do not support implicit function declarations
2026-09-24 5:48 UTC
[PATCH v10 2/2] dmaengine: fsl-edma: Support dynamic scatter/gather chaining
2026-09-24 3:39 UTC
sound/soc/cdns/cdns-i2s-sc.c:232:44: error: implicit declaration of function 'FIELD_PREP'
2026-09-24 3:14 UTC
arch/csky/include/asm/cmpxchg.h:61:58: warning: pointer type mismatch in conditional expression
2026-09-24 2:31 UTC
[qcom:arm64-for-7.4 96/132] arch/arm64/boot/dts/qcom/glymur-asus-zenbook-a14-ux3407na.dtb: aop-cmd-db@81c60000 (qcom,cmd-db): Unevaluated properties are not allowed ('no-map', 'reg' were unexpected)
2026-09-24 2:27 UTC
arch/sparc/kernel/perf_regs.c:39:5: error: conflicting types for 'perf_reg_validate'; have 'int(u64)' {aka 'int(long long unsigned int)'}
2026-09-24 1:05 UTC
drivers/acpi/loongarch/iovt.c:274:5: error: redefinition of 'iovt_iommu_configure_id'
2026-09-23 23:50 UTC
arch/sparc/kernel/perf_regs.c:39:5: error: conflicting types for 'perf_reg_validate'
2026-09-23 23:02 UTC
drivers/usb/host/bcma-hcd.c:470:12: error: invalid storage class for function 'bcma_hcd_suspend'
2026-09-23 22:06 UTC
drivers/usb/host/bcma-hcd.c:448:13: error: invalid storage class for function 'bcma_hcd_remove'
2026-09-23 21:23 UTC
[jimc:m10 40/44] drivers/mtd/chips/cfi_cmdset_0002.c:2428:(.xiptext+0xa0b): dangerous relocation: windowed longcall crosses 1GB boundary; return may fail: ddebug_increment_call_count
2026-09-23 19:33 UTC
arch/arm/boot/dts/nxp/imx/imx50-amazon-yoshi.dtb: mmc@50020000 (fsl,imx50-esdhc): Unevaluated properties are not allowed ('min-frequency' was unexpected)
2026-09-23 19:11 UTC
drivers/xen/grant-dma-ops.c:174 xen_grant_dma_map_phys() warn: mask and shift to zero: expr='offset >> 12'
2026-09-23 19:11 UTC
drivers/pinctrl/renesas/pinctrl-rzt2h.c:197 rzt2h_pinctrl_set_pfc_mode() warn: subtract is higher precedence than shift
2026-09-23 18:30 UTC
net/mac80211/tests/chan-mode.c:256 test_determine_chan_mode() warn: passing freed memory 'elems' (line 252)
2026-09-23 18:19 UTC
[paulmckrcu:dev 21/25] kernel/rcu/srcutree.c:1027 srcu_gp_end() warn: mixing irqsave and irq
2026-09-23 16:36 UTC
fs/notify/fsnotify.c:567 fsnotify() error: we previously assumed 'sbinfo->sb_marks' could be null (see line 535)
2026-09-23 16:14 UTC
word-at-a-time.h:206:10: fatal error: asm-generic/word-at-a-time-instrumented.h: No such file or directory
2026-09-23 16:14 UTC
drivers/crypto/ti/dthev2-common.c:44 dthe_get_dev() warn: can 'dev_data' even be NULL?
2026-09-23 16:03 UTC
arch/x86/coco/sev/core.c:996:69-74: opportunity for str_write_read(write)
2026-09-23 15:12 UTC
[paulmckrcu:dev 4/25] drivers/hid/hid-steam.c:557 steam_send_report_id() warn: check sign expansion for '__UNIQUE_ID_x__456'
2026-09-23 15:11 UTC
[PATCH v10 2/2] dmaengine: fsl-edma: Support dynamic scatter/gather chaining
2026-09-23 13:16 UTC
arch/arm64/boot/dts/rockchip/rk3588-orangepi-5-plus.dtb: hdmi-receiver-cma (shared-dma-pool): Unevaluated properties are not allowed ('alignment', 'alloc-ranges', 'no-map', 'size' were unexpected)
2026-09-23 12:23 UTC
[jimc:dyndbg-maple-clean 45/45] lib/dynamic_debug.c:1962 ddebug_reconstruct_site_map() error: double free of 'decompressed_sites' (line 1940)
2026-09-23 9:47 UTC
[jimc:m10 35/44] lib/dynamic_debug.c:854 param_set_dyndbg_module_classes() error: we previously assumed 'map' could be null (see line 841)
2026-09-23 8:37 UTC (2+ messages)
[linux-next:master 7416/8910] drivers/power/sequencing/pwrseq-kunit.c:248 pwrseq_circular_deps() warn: passing zero to 'PTR_ERR'
2026-09-23 8:22 UTC
[linux-next:master 4776/8910] drivers/net/ethernet/xilinx/xilinx_axienet_main.c:2974 axienet_probe() warn: platform_get_irq() does not return zero
2026-09-23 8:07 UTC (4+ messages)
[akpm-mm:mm-unstable 425/627] fs/btrfs/extent_io.c:1262 can_skip_one_ordered_range() error: 'folio' dereferencing possible ERR_PTR()
2026-09-23 7:49 UTC
[linux-next:master 1917/8910] make[1]: *** No rule to make target 'tools/testing/selftests/filesystems/fuse/test_syncfs', needed by 'all'
2026-09-23 7:29 UTC
[linux-next:master 6897/8910] include/linux/device.h:1124 class_device_try_constructor() warn: passing zero to 'ERR_PTR'
2026-09-23 7:16 UTC
Documentation/devicetree/bindings/net/allwinner,sun8i-a83t-emac.yaml: properties:syscon:items:0: {'minItems': 1, 'maxItems': 2, 'items': [{'description': 'Phandle to the device containing the EMAC or GMAC clock register'}, {'description': 'Register index
2026-09-23 7:06 UTC
[pci:controller/dwc-rcar-gen4 8/9] Documentation/devicetree/bindings/pci/rcar-gen4-pci-ep.yaml: properties:reset-names: {'minItems': 1, 'maxItems': 2, 'items': [{'const': 'pwr'}, {'const': 'core'}]} should not be valid under {'required': ['maxItems']}
2026-09-23 6:45 UTC
[linux-next:master 7149/8910] drivers/gpu/drm/display/drm_hdmi_helper.c:656 drm_connector_hdmi_sync_scdc() warn: variable dereferenced before check 'connector' (see line 650)
2026-09-23 3:50 UTC
[pci:controller/dwc-rcar-gen4 7/9] Documentation/devicetree/bindings/pci/rcar-gen4-pci-host.yaml: properties:reset-names: {'minItems': 1, 'maxItems': 2, 'items': [{'const': 'pwr'}, {'const': 'core'}]} should not be valid under {'required': ['maxItems']}
2026-09-23 3:50 UTC
[linux-next:master 8362/8910] drivers/hid/hid-steam.c:557 steam_send_report_id() warn: check sign expansion for '__UNIQUE_ID_x__454'
2026-09-23 3:18 UTC
[rafael-pm:bleeding-edge 117/144] include/linux/cleanup.h:211:92: warning: suggest braces around empty body in an 'if' statement
2026-09-23 1:44 UTC
drivers/gpu/drm/xe/xe_gt_sriov_pf_debugfs.c:310:9: sparse: sparse: an expression is expected before ')'
2026-09-22 19:36 UTC
{standard input}:16594: Error: branch out of range
2026-09-22 14:49 UTC
drivers/gpu/drm/xe/xe_guc_ads.c:353:9: sparse: sparse: Trying to use reserved word 'if' as identifier
2026-09-22 14:44 UTC
lib/raid/xor/xor-neon.c:21:9: sparse: sparse: Trying to use reserved word 'do' as identifier
2026-09-22 9:17 UTC
sound/soc/fsl/fsl_easrc.c:57:22: sparse: sparse: unsigned value that used to be signed checked against zero?
2026-09-22 8:52 UTC
arch/arm64/boot/dts/rockchip/rk3588-orangepi-5-plus.dtb: hdmi-receiver-cma (shared-dma-pool): Unevaluated properties are not allowed ('alignment', 'alloc-ranges', 'no-map', 'size' were unexpected)
2026-09-22 6:12 UTC
arch/riscv/boot/dts/microchip/pic64gx-curiosity-kit.dtb: hss-buffer@bfc00000 (shared-dma-pool): Unevaluated properties are not allowed ('no-map', 'reg' were unexpected)
2026-09-20 7:24 UTC
lib/raid/raid6/arm/recov_neon_inner.c:50:9: sparse: sparse: Trying to use reserved word 'while' as identifier
2026-09-20 4:37 UTC
drivers/iio/magnetometer/qmc5883l.c:377:8: error: call to '__compiletime_assert_550' declared with 'error' attribute: FIELD_PREP: value too large for the field
2026-09-19 21:28 UTC
drivers/pci/endpoint/functions/pci-epf-test.c:769:7-27: WARNING: Threaded IRQ with no primary handler requested without IRQF_ONESHOT (unless it is nested IRQ)
2026-09-19 13:17 UTC (3+ messages)
[android-common:android13-5.10 1/1] arch/x86/kernel/static_call.c:19:17: warning: 'tramp_ud' defined but not used
2026-09-19 8:28 UTC
include/asm-generic/preempt.h:66:9: sparse: sparse: Trying to use reserved word 'return' as identifier
2026-09-19 2:55 UTC
fs/f2fs/checkpoint.o: warning: objtool: __f2fs_add_ino_entry+0x128: unreachable instruction
2026-09-19 1:19 UTC
drivers/gpu/drm/i915/display/tests/intel_dp_link_test.c:213:24: sparse: sparse: not a function iter_start
2026-09-19 1:09 UTC
arch/arm/include/asm/neon-intrinsics.h:7:2: sparse: sparse: You should compile this file with '-march=armv7-a -mfloat-abi=softfp -mfpu=neon'
2026-09-18 20:56 UTC
drivers/gpu/drm/amd/display/dc/dml/dml1_frl_cap_chk.c:506:20-21: WARNING opportunity for max()
2026-09-18 19:10 UTC
arch/riscv/kernel/signal.c:196 __restore_cfiss_state() warn: maybe return -EFAULT instead of the bytes remaining?
2026-09-18 18:19 UTC
drivers/gpu/drm/i915/display/tests/intel_dp_link_test.c:72:59: sparse: sparse: not a function init
2026-09-18 17:33 UTC
[android-common:android14-kiwi-6.1 274/274] load_address.c:81:25: warning: incompatible implicit declaration of built-in function 'strstr'
2026-09-18 14:45 UTC
[PATCH net v2 1/1] net: gso: limit recursive IP-in-IP segmentation
2026-09-18 11:12 UTC
[linux-next:master 6680/8072] drivers/gpu/drm/i915/display/intel_link_bw.c:69 intel_link_bw_init_limits() error: we previously assumed 'crtc_state' could be null (see line 67)
2026-09-18 9:31 UTC
sound/soc/tegra/tegra210_mixer.c:219 tegra210_mixer_put_fade_duration() warn: impossible condition '(duration > 2147483647) => (33-s32max > s32max)'
2026-09-18 8:59 UTC
arch/arm/boot/dts/aspeed/aspeed-bmc-facebook-anacapa.dtb: /ahb/apb/lpc@1e789000/lhc@a0: failed to match any schema with compatible: ['aspeed,ast2600-lhc']
2026-09-18 4:53 UTC
drivers/gpu/drm/amd/display/dc/hubp/dcn42/dcn42_hubp.c:609:35-36: hubp_program_3dlut_fl_config: first occurrence line 640, second occurrence line 646
2026-09-18 1:53 UTC
[akpm-mm:mm-unstable 145/442] drivers/clocksource/timer-atmel-pit.c:261 at91sam926x_pit_dt_init() warn: 'data->base' from of_iomap() not released on lines: 261
2026-09-17 23:39 UTC
arch/arm/boot/dts/ti/omap/am335x-sbc-t335.dtb: lcdc@0 (ti,am33xx-tilcdc): 'port' is a required property
2026-09-17 23:08 UTC
net/xfrm/xfrm_input.c:839:2-10: WARNING: NULL check before (net)dev_{put, hold} functions is not needed
2026-09-17 22:48 UTC
include/asm-generic/bitsperlong.h:23:2: sparse: sparse: Inconsistent word size. Check asm/bitsperlong.h
2026-09-17 21:29 UTC
drivers/net/ethernet/pensando/ionic/ionic_txrx.c:204 ionic_rx_build_skb() warn: '(((((((1) << 16)) < ((-1))) ?(((1) << 16)):((-1))) - (18 + 256 + ((((320)) + ((((1 << 7))) - 1)) & ~((((1 << 7))) - 1)))) + 18)' 18446744073709550975 can't fit into 65535 '__
2026-09-17 18:23 UTC
drivers/gpu/drm/xe/xe_guc_ads.c:411:9: sparse: sparse: Trying to use reserved word 'return' as identifier
2026-09-17 17:34 UTC
drivers/gpu/drm/amd/display/dc/dml2_0/dml21/src/dml2_core/dml2_core_dcn4_calcs.c:6405:53-54: WARNING opportunity for min()
2026-09-17 17:12 UTC
[jgunthorpe:mlx5st 5/11] include/arm64/processor.h:194:9: warning: "dma_wmb" redefined
2026-09-17 17:01 UTC
[sashal-next:arch-next 19/20] arm64/vgic_its_save.c:289:21: error: too many arguments to function 'vm_phy_pages_alloc'
2026-09-17 12:47 UTC
[linux-next:master 1693/7047] security/lsm_audit.c:185:2: error: call to '__compiletime_assert_708' declared with 'error' attribute: BUILD_BUG_ON failed: sizeof(a->u) > sizeof(void *)*2
2026-09-17 12:40 UTC
/bin/bash: line 1: 946980 Segmentation fault ld.lld -m elf_x86_64 -mllvm -import-instr-limit=5 --mllvm=-enable-fs-discriminator=true --mllvm=-improved-fs-discriminator=true -plugin-opt=thinlto -plugin-opt=-split-machine-functions -z noexecstack -r -o
2026-09-17 11:15 UTC
drivers/gpu/drm/xe/xe_guc_ads.c:411:9: sparse: sparse: Trying to use reserved word 'return' as identifier
2026-09-17 5:30 UTC
page: next (older) | prev (newer) | latest
- recent:[subjects (threaded)|topics (new)|topics (active)]
This is a public inbox, see mirroring instructions
for how to clone and mirror all data and code used for this inbox