messages from 2026-09-23 07:02:49 to 2026-09-27 07:43:53 UTC [more...]
[OE-core][wrynose 00/28] Patch review
2026-09-27 7:43 UTC (2+ messages)
` [OE-core][wrynose 16/28] sbom-cve-check-update-{nvd-native,cvelist-native}: upgrade 2026.08.25 -> 2026.09.12
[PATCH v3] tiff: add ptest support
2026-09-27 7:32 UTC (2+ messages)
` [OE-core] "
[OE-core][wrynose][PATCH 1/6] curl: Security Fix for CVE-2026-13608
2026-09-27 6:35 UTC (3+ messages)
` [OE-core][wrynose][PATCH 2/6] curl: Security Fix for CVE-2026-18924
[AUH] python3-meson-python: upgrading to 0.22.0 SUCCEEDED
2026-09-27 5:16 UTC
[AUH] gtk-doc: upgrading to 1.37.0 SUCCEEDED
2026-09-27 5:16 UTC
[AUH] Upgrade status: 2026-09-27
2026-09-27 5:16 UTC
[PATCH][wrynose] gnutls: upgrade 3.8.12 -> 3.8.13
2026-09-26 20:49 UTC (2+ messages)
` [OE-core] "
[wrynose][oe-core][PATCH 1/5] ffmpeg: Fix for CVE-2026-66036
2026-09-26 20:37 UTC (4+ messages)
` [wrynose][oe-core][PATCH 5/5] ffmpeg: Fix for CVE-2026-66041
[oe-core][PATCHv2] cpan: do not rebuild the Makefile when perls config is re-staged
2026-09-26 19:11 UTC
[oe-core][PATCH 1/5] gcr: initialize libgcrypt from the secret exchange
2026-09-26 19:03 UTC (11+ messages)
` [oe-core][PATCH 2/5] cpan: survive the Makefile that MakeMaker rebuilds under us
` [oe-core][PATCH 5/5] go-mod-update-modules: include the generated files from the class
[PATCH] kernel: use absolute paths in the kernel-image scripts
2026-09-26 15:01 UTC (2+ messages)
[PATCH] initramfs-framework: retry LABEL lookup before coldplug fallback
2026-09-26 14:42 UTC (2+ messages)
[OE-core][PATCH] libpcre2-ptest: add testoutput3C for locale variant
2026-09-26 13:32 UTC (2+ messages)
[PATCH wrynose 0/4] spdx: fix the compiled-sources filter
2026-09-26 9:19 UTC (2+ messages)
` [OE-core] "
[AUH] python3-pbr: upgrading to 7.1.2 SUCCEEDED
2026-09-26 5:25 UTC
[AUH] diffoscope: upgrading to 331 SUCCEEDED
2026-09-26 5:25 UTC
[AUH] Upgrade status: 2026-09-26
2026-09-26 5:25 UTC
[AUH] python3-markdown: upgrading to 3.11 SUCCEEDED
2026-09-26 5:25 UTC
[AUH] gdb-cross-canadian-x86-64,gdb,gdb-cross-x86_64: upgrading to 18.1 FAILED
2026-09-26 5:25 UTC
[OE-core][scarthgap 00/47] Pull request (cover letter only)
2026-09-25 22:58 UTC
[PATCH] compiler-rt: Use specific arm architecture instead of 'arm'
2026-09-25 17:37 UTC (2+ messages)
` [OE-core] "
[PATCH 1/2] sqlite3: Squash sqlite3.inc into the recipe
2026-09-25 16:56 UTC (2+ messages)
` [PATCH 2/2] sqlite3: Add support for the unlock notify API, and enable it for target
[PATCH] lame: add context to patches
2026-09-25 14:52 UTC
[PATCH 1/2] linux-yocto-dev: drop DeviceTree validation dependencies
2026-09-25 13:10 UTC (4+ messages)
` [PATCH 2/2] python3-dtschema-wrapper: remove obsolete recipe
[PATCH] gcr: remove now-redundant gnome_verdir() replacement
2026-09-25 11:58 UTC
[PATCH v2] gstreamer: skip test_queue:test_leaky_downstream test as it's flakey
2026-09-25 10:53 UTC
[OE-core][PATCH] wget: fix CVE-2026-15146
2026-09-25 10:30 UTC
[PATCH] clang/llvm: Upgrade to 23.1.2 release
2026-09-25 9:21 UTC
[PATCH] gstreamer: skip test_queue:test_leaky_downstream test as it's flakey
2026-09-25 9:03 UTC
[PATCH v2 1/2] create-spdx-3.0: record component release date in SPDX output
2026-09-25 8:24 UTC (2+ messages)
` [PATCH v2 2/2] scripts/contrib: add spdx-release-date-report.py
[PATCH 1/2] rt-tests: drop Makefile CC/AR patch and use EXTRA_OEMAKE
2026-09-25 8:20 UTC (2+ messages)
` [PATCH] rt-tests/hwlatdetect: upgrade 2.10 -> 2.11
[AUH] parted: upgrading to 3.8 SUCCEEDED
2026-09-25 6:52 UTC
[AUH] Upgrade status: 2026-09-25
2026-09-25 6:52 UTC
[AUH] libuv: upgrading to 1.53.0 SUCCEEDED
2026-09-25 6:52 UTC
[AUH] libpam: upgrading to 1.7.3 SUCCEEDED
2026-09-25 6:52 UTC
[AUH] python3-uv-build: upgrading to 0.12.19 SUCCEEDED
2026-09-25 6:52 UTC
[AUH] epiphany: upgrading to 51.1 SUCCEEDED
2026-09-25 6:52 UTC
[scarthgap][PATCH] fs-util: try AT_EMPTY_PATH for access_fd() first
2026-09-25 6:43 UTC (3+ messages)
` [OE-core] "
[oe-core][PATCH] libx11: stage the X11 locale data in the native sysroot
2026-09-25 6:42 UTC
[OE-core][scarthgap][PATCH 5/6] libxml2: Security Fix for CVE-2026-86141
2026-09-25 1:34 UTC (2+ messages)
[PATCH] go: skip internal/cgrouptest when cpu.max is not available
2026-09-25 2:22 UTC
[PATCH] go: skip internal/cgrouptest when cpu.max is not available
2026-09-25 1:48 UTC
[PATCH] xxhash: inherit lib_package
2026-09-24 17:16 UTC
[PATCH 1/4] lib/oe/package: remove unused and optional fatal argument to source_info()
2026-09-24 15:57 UTC (4+ messages)
` [PATCH 2/4] elfutils: fix handling of DWARF5 compilation units
` [PATCH 3/4] classes/package: use eu-srcfiles instead of dwarfsrcfiles
` [PATCH 4/4] dwarfsrcfiles: remove
[OE-core][PATCH v1] util-linux: ptest: fix flock test timeout on slow targets
2026-09-24 15:05 UTC (2+ messages)
[PATCH] gcc: Fix configargs.h build arch contamination
2026-09-24 14:17 UTC
[PATCH v4] systemd: backport fix for limits.h override
2026-09-24 13:33 UTC
[PATCH v3] systemd: fix musl build by fixing limits.h override
2026-09-24 13:00 UTC (2+ messages)
` [OE-core] "
[OE-core[scarthgap][v2][PATCH 1/2] python3-pyasn1: fix CVE-2026-30922
2026-09-24 12:15 UTC (2+ messages)
` [OE-core][scarthgap][v2][PATCH 2/2] python3-pyasn1: fix CVE-2026-59885
[OE-core][PATCH] python3: ptest: skip flaky test_staggered_race_with_eager_tasks
2026-09-24 11:43 UTC
[OE-core][wrynose v2 00/78] Pull request (cover letter only)
2026-09-24 11:39 UTC
[PATCH] go-mod-update-modules: Combine env with fetcher environment
2026-09-24 11:15 UTC
[PATCH 0/3] nfs-utils: musl upgrade to 3.1.1 and prerequisite systemd fixes
2026-09-24 10:59 UTC (6+ messages)
` [PATCH v2 0/3] systemd musl build fixes and nfs-utils upgrade
` [PATCH v2 1/3] systemd: fix musl build by fixing limits.h override
` [OE-core] "
` [PATCH v2 2/3] systemd: dlopen-deps: only warn for missing required providers
` [OE-core] "
[OE-core][scarthgap][Patch 00/11] u-boot-tools: address multiple CVEs
2026-09-24 10:56 UTC (5+ messages)
` [OE-core][scarthgap][Patch 02/11] u-boot-tools: Ignore CVE-2024-42040
` [scarthgap][Patch "
[scarthgap][PATCH v2] glibc: Fix CVE-2026-6238
2026-09-24 9:26 UTC
[PATCH v2] kernel-fit-image: remove fatal error when .crt file is missing
2026-09-24 9:23 UTC
[PATCH] remove fatal error when .crt file is missing at fitimage sanity check
2026-09-24 9:01 UTC (2+ messages)
` Patchtest results for "
[OE-core][scarthgap][PATCH 1/3] curl: Security Fix for CVE-2026-13608
2026-09-24 6:58 UTC (3+ messages)
` [OE-core][scarthgap][PATCH 2/3] curl: Security Fix for CVE-2026-18924
[OE-core][scarthgap 00/48] Patch review
2026-09-24 6:56 UTC (51+ messages)
` [OE-core][scarthgap 01/48] wireless-regdb: upgrade 2026.05.30 -> 2026.09.03
` [OE-core][scarthgap 02/48] ca-certificates: upgrade 20260601 -> 20260816
` [OE-core][scarthgap 03/48] testimage: avoid symlinking missing qemu boot log
` [OE-core][scarthgap 04/48] python3-pip: set CVE_STATUS for CVE-2018-20225
` [OE-core][scarthgap 05/48] python3-ply: set status for CVE-2025-56005
` [OE-core][scarthgap 06/48] kbd: Fix CVE-2026-72693
` [OE-core][scarthgap 07/48] gnutls: fix CVE-2026-33845
` [OE-core][scarthgap 08/48] python3-mako: correct CVE_PRODUCT mapping
` [OE-core][scarthgap 09/48] python3-pip: Fix CVE-2026-13346
` [OE-core][scarthgap 10/48] perl: Fix CVE-2026-19487
` [OE-core][scarthgap 11/48] vim: Fix for CVE-2026-73072
` [OE-core][scarthgap 12/48] vim: Fix for CVE-2026-73073
` [OE-core][scarthgap 13/48] vim: Fix for CVE-2026-73074
` [OE-core][scarthgap 14/48] vim: Fix for CVE-2026-73077
` [OE-core][scarthgap 15/48] vim: Fix for CVE-2026-73078
` [OE-core][scarthgap 16/48] cpio: patch CVE-2026-66485
` [OE-core][scarthgap 17/48] cpio: patch CVE-2026-66484
` [OE-core][scarthgap 18/48] wget: Fix CVE-2026-58470
` [OE-core][scarthgap 19/48] gnutls: fix CVE-2026-5419
` [OE-core][scarthgap 20/48] curl: set CVE_STATUS for CVE-2026-8458
` [OE-core][scarthgap 21/48] vim: Fix CVE-2026-52858 regression
` [OE-core][scarthgap 22/48] improve_kernel_cve_report: validate that cve details field exists
` [OE-core][scarthgap 23/48] improve_kernel_cve_report: fix backported-patch check
` [OE-core][scarthgap 24/48] libxfont: Fix CVE-2026-56001
` [OE-core][scarthgap 25/48] libxfont: Fix CVE-2026-56002
` [OE-core][scarthgap 26/48] libxfont: Fix CVE-2026-56003
` [OE-core][scarthgap 27/48] golang: fix homepage
` [OE-core][scarthgap 28/48] python3-certifi: "
` [OE-core][scarthgap 29/48] gcc: Upgrade to GCC 13.5
` [OE-core][scarthgap 30/48] python3-git: fix CVE-2026-42215
` [OE-core][scarthgap 31/48] scripts/install-buildtools: Update to 5.0.20
` [OE-core][scarthgap 32/48] spdx30_tasks: Fix SPDX_CUSTOM_ANNOTATION_VARS implementation
` [OE-core][scarthgap 33/48] python3: skip ptest incompatible with ptest-runner >= 2.5.0
` [OE-core][scarthgap 34/48] ptest-runner: upgrade 2.4.5 -> 2.4.5.1
` [OE-core][scarthgap 35/48] ptest-runner: Upgrade 2.4.5.1 -> 2.5.0
` [OE-core][scarthgap 36/48] ptest-runner: Upgrade 2.5.0 -> 2.5.1
` [OE-core][scarthgap 37/48] pseudo: Add in openat2, exec and linkat fixes
` [OE-core][scarthgap 38/48] pseudo: Update to 1.9.10
` [OE-core][scarthgap 39/48] pseudo: 1.9.10 -> 1.9.11
` [OE-core][scarthgap 40/48] libslirp: patch CVE-2026-9539
` [OE-core][scarthgap 41/48] rootfs.py: fix run-postinsts removal on multilib images
` [OE-core][scarthgap 42/48] python3-cryptography: Fix CVE-2026-34073
` [OE-core][scarthgap 43/48] python3-cryptography: Fix CVE-2026-69248
` [OE-core][scarthgap 44/48] python3-cryptography: Fix CVE-2026-69249
` [OE-core][scarthgap 45/48] curl: Security Fix for CVE-2026-13608
` [OE-core][scarthgap 46/48] curl: Security Fix for CVE-2026-18924
` [OE-core][scarthgap 47/48] curl: set CVE_STATUS for CVE-2026-82209
` [OE-core][scarthgap 48/48] time64: enable 64-bit time/file-offset flags for 32-bit nativesdk
[PATCH] barebox: install generated dtbs
2026-09-24 6:09 UTC
[PATCH 1/2] devtool: ide-sdk: make nfs export script quicker
2026-09-24 6:01 UTC (2+ messages)
` [PATCH 2/2] devtool: ide-sdk: allow ide plugins to add packages rootfs-dbg
[AUH] python3-pytz: upgrading to 2026.4 SUCCEEDED
2026-09-24 5:34 UTC
[AUH] python3-setuptools-scm: upgrading to 10.3.4 FAILED
2026-09-24 5:34 UTC
[AUH] Upgrade status: 2026-09-24
2026-09-24 5:34 UTC
[AUH] python3-vcs-versioning: upgrading to 2.5.0 SUCCEEDED
2026-09-24 5:34 UTC
[AUH] gnupg: upgrading to 2.5.24 SUCCEEDED
2026-09-24 5:34 UTC
[AUH] shadow: upgrading to 4.20.3 FAILED
2026-09-24 5:34 UTC
[AUH] python3-wcwidth: upgrading to 0.9.1 SUCCEEDED
2026-09-24 5:34 UTC
[AUH] repo: upgrading to 2.68.1 SUCCEEDED
2026-09-24 5:34 UTC
[OE-core][PATCH 00/13] resulttool: add 'durations' subcommand and selftests
2026-09-24 2:17 UTC (15+ messages)
` [OE-core][PATCH 01/13] scripts: resulttool: add 'durations' option
` [OE-core][PATCH 02/13] selftest: resulttooltests.py: add basic durations test
` [OE-core][PATCH 03/13] selftest: resulttooltests.py: add report-log Time(s) column test
` [OE-core][PATCH 04/13] selftest: resulttooltests.py: add zero-round pct suppression test
` [OE-core][PATCH 05/13] selftest: resulttooltests.py: add consecutive-pair delta test
` [OE-core][PATCH 06/13] selftest: resulttooltests.py: add threshold filtering test
` [OE-core][PATCH 07/13] selftest: resulttooltests.py: add threshold-disabled test
` [OE-core][PATCH 08/13] selftest: resulttooltests.py: add multi-pair threshold test
` [OE-core][PATCH 09/13] selftest: resulttooltests.py: add None-pct "
` [OE-core][PATCH 10/13] selftest: resulttooltests.py: add sort-by-delta test
` [OE-core][PATCH 11/13] selftest: resulttooltests.py: add limit-after-sort test
` [OE-core][PATCH 12/13] selftest: resulttooltests.py: add short-tables ordering test
` [OE-core][PATCH 13/13] selftest: resulttooltests.py: add min-duration default test
Topic: native libstdc++ and uninative
2026-09-23 21:31 UTC (5+ messages)
` [OE-core] "
[PATCH v2 0/3] Fix kernel complementary package installation
2026-09-23 20:51 UTC (4+ messages)
` [PATCH v2 1/3] kernel.bbclass: make the -src package installable on purpose
` [PATCH v2 2/3] core-image.bbclass: do not pull the kernel -src package in via complementary packages
` [PATCH v2 3/3] oe/package.py: copydebugsources: add all kernel source files
[scarthgap][PATCH] u-boot-tools: use all patches from u-boot
2026-09-23 17:38 UTC
[PATCH 1/9] classes/cargo_common: move PKG_CONFIG_ALLOW_CROSS export to oe_cargo_fix_env
2026-09-23 17:17 UTC (5+ messages)
` [PATCH 8/9] classes/cargo-c: pass flags via CARGO_BUILD_FLAGS
` [OE-core] "
PATCH] coreutils: Upgrade 9.11 -> 9.12
2026-09-23 16:58 UTC
[PATCH 0/2] libsecret: upgrade 0.21.7 -> 0.21.8.2
2026-09-23 14:45 UTC (7+ messages)
` [PATCH v2 0/2] libsecret: upgrade to 0.21.8.2 and fix gnomebase verdir
` [PATCH v2 1/2] gnomebase: fix gnome_verdir for four-component versions
` [OE-core] "
[PATCH] classes/gnomebase: improve gnome_verdir() logic
2026-09-23 14:40 UTC
[PATCH 1/6] gnupg: upgrade 2.5.22 -> 2.5.23
2026-09-23 14:33 UTC (8+ messages)
` [PATCH 2/6] libslirp: upgrade 4.9.4 -> 4.9.5
` [PATCH 3/6] meson: upgrade 1.12.0 -> 1.12.1
` [PATCH 4/6] python3-hypothesis: upgrade 6.168.0 -> 6.168.1
` Patchtest results for "
` [PATCH 5/6] python3-mako: upgrade 1.4.1 -> 1.4.3
` [PATCH 6/6] python3-pdm-backend: upgrade 2.4.9 -> 2.4.10
` Patchtest results for "
[PATCH] externalsrc: fix PKGV for devtool build
2026-09-23 14:08 UTC (2+ messages)
` [OE-core] "
[PATCH] coreutils: Upgrade 9.11 -> 9.12
2026-09-23 14:06 UTC
[PATCH] libinput: Upgrade 1.31.3 -> 1.32.0
2026-09-23 12:59 UTC
[PATCH] layer.conf: Drop wrynose from CORENAMES ready for release
2026-09-23 9:35 UTC
[scarthgap][PATCH] systemd: backport networkd route readiness fix from upstream
2026-09-23 8:39 UTC
[AUH] systemd-boot,systemd-tools-native,systemd-boot-native,systemd: upgrading to 262,262,262,262 FAILED
2026-09-23 8:34 UTC (3+ messages)
` [OE-core] "
[PATCH] gpgme: Upgrade 2.1.2 -> 2.2.0
2026-09-23 8:00 UTC
[PATCH 1/5] diffoscope: upgrade 329 -> 330
2026-09-23 7:20 UTC (5+ messages)
` [PATCH 2/5] libsolv: upgrade 0.7.39 -> 0.7.40
` [PATCH 3/5] python3-trove-classifiers: upgrade 2026.6.1.19 -> 2026.9.21.13
` [PATCH 4/5] repo: upgrade 2.67 -> 2.68
` [PATCH 5/5] ttyrun: upgrade 2.44.0 -> 2.44.1
[OE-core][scarthgap][PATCH] python3-click: fix CVE-2026-7246
2026-09-23 7:02 UTC (5+ messages)
` [scarthgap][PATCH] "
` [OE-core] "
page: next (older) | prev (newer) | latest
- recent:[subjects (threaded)|topics (new)|topics (active)]
This is a public inbox, see mirroring instructions
for how to clone and mirror all data and code used for this inbox