Openembedded Core Discussions
 help / color / mirror / Atom feed
 messages from 2026-09-23 17:06:46 to 2026-09-28 07:12:31 UTC [more...]

[scarthgap][PATCH 1/6] bind: fix for CVE-2026-10723
 2026-09-28  7:11 UTC 

[OE-core][scarthgap][PATCH v2] apr-util: Fix CVE-2025-49506
 2026-09-28  6:55 UTC 

[AUH] ccache: upgrading to 4.14.1 SUCCEEDED
 2026-09-28  5:17 UTC 

[AUH] dbus-glib: upgrading to 0.116 SUCCEEDED
 2026-09-28  5:17 UTC 

[AUH] Upgrade status: 2026-09-28
 2026-09-28  5:17 UTC 

[AUH] python3-hypothesis: upgrading to 6.168.2 SUCCEEDED
 2026-09-28  5:17 UTC 

[PATCH 1/2] elfutils: Fix backtrace ptests on musl
 2026-09-28  5:00 UTC  (2+ messages)
` [PATCH 2/2] libc-test: Always add libatomic-staticdev to ptest RDEPENDS

OE-core CVE metrics for master on Mon Sep 28 03:04:28 2026
 2026-09-28  4:56 UTC  (3+ messages)
` OE-core CVE metrics for scarthgap on Mon Sep 28 03:03:58 2026
` OE-core CVE metrics for wrynose on Mon Sep 28 03:05:04 2026

[PATCH] multilib: skip cross-canadian recipes when renaming package variables
 2026-09-28  3:53 UTC 

[PATCH 1/2] siteinfo: add siteinfo_get_files_for_machine()
 2026-09-28  1:46 UTC  (2+ messages)
` [PATCH 2/2] toolchain-scripts/meta-environment: use each variant's own site files

[PATCH 1/2] musl: Fall back to VERSION when git describe finds nothing
 2026-09-28  0:32 UTC  (2+ messages)
` [PATCH 2/2] musl: Upgrade to latest tip of trunk

[PATCH 1/9] binutils: set status for CVE-2026-3441 and CVE-2026-3442
 2026-09-27 19:36 UTC  (9+ messages)
` [PATCH 2/9] glibc: set status for CVE-2026-19542
` [PATCH 3/9] ffmpeg: set status for CVE-2026-58049
` [PATCH 4/9] ffmpeg: set status for 6 CVEs
` [PATCH 5/9] libxfont: set status for CVE-2026-44950 and CVE-2026-59679
` [PATCH 6/9] openssh: set status for CVE-2026-55655
` [PATCH 7/9] openssh: set status for CVE-2026-55654
` [PATCH 8/9] bluez5: set status for CVE-2026-19774
` [PATCH 9/9] graphene: set status for CVE-2026-81281

[PATCH 0/5] devtool ide-sdk: support --modified and --shared modes
 2026-09-27 17:44 UTC  (6+ messages)
` [PATCH 1/5] devtool: ide-sdk: support shared recipe IDE hooks
` [PATCH 2/5] devtool: ide-sdk: initialize shared images for IDE plugins
` [PATCH 3/5] devtool: ide-sdk: support NFS exports in shared mode
` [PATCH 4/5] devtool: ide-sdk: allow combining shared and modified modes
` [PATCH 5/5] oe-selftest: devtool ide-sdk: cover modified + shared + NFS

[PATCH 1/2] gtk-doc: upgrade 1.36.1 -> 1.37.0
 2026-09-27 16:50 UTC  (2+ messages)
` [PATCH 2/2] python3-meson-python: upgrade 0.21.1 -> 0.22.0

[PATCH 1/8] erofs-utils: Make reproducible for different BUILD_ARCH
 2026-09-27 16:46 UTC  (8+ messages)
` [PATCH 2/8] diffoscope: upgrade 330 -> 331
` [PATCH 3/8] python3-markdown: upgrade 3.10.3 -> 3.11
` [PATCH 4/8] epiphany: upgrade 51.0 -> 51.1
` [PATCH 5/8] libpam: upgrade 1.7.2 -> 1.7.3
` [PATCH 6/8] libuv: upgrade 1.52.1 -> 1.53.0
` [PATCH 7/8] parted: upgrade 3.7 -> 3.8
` [PATCH 8/8] python3-uv-build: upgrade 0.12.17 -> 0.12.19

[PATCH] libpwquality: add tag to git url
 2026-09-27 16:23 UTC 

[PATCH] ruby: strip the build machine triplet from rbconfig.rb
 2026-09-27 15:41 UTC 

[PATCH] curl: strip the build machine triplet from curl-config
 2026-09-27 15:35 UTC 

[PATCH v2 1/2] create-spdx-3.0: record component release date in SPDX output
 2026-09-27 10:03 UTC  (3+ messages)
` [PATCH v2 2/2] scripts/contrib: add spdx-release-date-report.py
` [OE-core] [PATCH v2 1/2] create-spdx-3.0: record component release date in SPDX output

[wrynose][PATCH 1/8] glibc: set status for CVE-2011-0536 and CVE-2025-0577
 2026-09-27  8:59 UTC  (8+ messages)
` [wrynose][PATCH 2/8] gnutls: set status for CVE-2023-0361
` [wrynose][PATCH 3/8] libarchive: set status for CVE-2026-4424
` [wrynose][PATCH 4/8] nfs-utils: set status for CVE-2025-12801
` [wrynose][PATCH 5/8] openssl: set status for CVE-2015-3216
` [wrynose][PATCH 6/8] ovmf: set status of CVE-2017-5731 and CVE-2019-14584
` [wrynose][PATCH 7/8] ppp: set status for CVE-2020-15704
` [wrynose][PATCH 8/8] pulseaudio: set status for CVE-2020-15710 and CVE-2020-16123

[OE-core][wrynose 00/28] Patch review
 2026-09-27  7:43 UTC  (29+ messages)
` [OE-core][wrynose 01/28] go: upgrade 1.26.7 -> 1.26.8
` [OE-core][wrynose 02/28] cpio: fix "CVE:" marker in CVE-2026-66484.patch
` [OE-core][wrynose 03/28] dhcpcd: upgrade 10.3.1 -> 10.3.2
` [OE-core][wrynose 04/28] kernel-fit-image: Don't add hash node when signing is enabled
` [OE-core][wrynose 05/28] ffmpeg: mark CVE-2026-52295, CVE-2026-52296 and CVE-2026-52297 fixed
` [OE-core][wrynose 06/28] libxfont2: patch CVE-2026-59679
` [OE-core][wrynose 07/28] libxfont2: patch CVE-2026-44950
` [OE-core][wrynose 08/28] bluez5: restrict delta=0 RSSI to proximity filters
` [OE-core][wrynose 09/28] fmt: update branch name to main
` [OE-core][wrynose 10/28] vim: Fix CVE-2026-28417 hostname regression
` [OE-core][wrynose 11/28] toolchain-scripts: fix kernel host tool builds broken in the SDK
` [OE-core][wrynose 12/28] at-spi2-core: RDEPENDS on gsettings-desktop-schemas
` [OE-core][wrynose 13/28] sbom-cve-check-update-nvd-native,sbom-cve-check-update-cvelist-native: upgrade 2026.08.03-000011 -> 2026.08.25-000009
` [OE-core][wrynose 14/28] sbom-cve-check-update-db: Exclude recipes from rm_work
` [OE-core][wrynose 15/28] python3-sbom-cve-check: update to version 1.3.4
` [OE-core][wrynose 16/28] sbom-cve-check-update-{nvd-native,cvelist-native}: upgrade 2026.08.25 -> 2026.09.12
` [OE-core][wrynose 17/28] python3-sbom-cve-check: update to version 1.3.5
` [OE-core][wrynose 18/28] qemu: fix CVE-2026-48914
` [OE-core][wrynose 19/28] bitbake.conf: pseudo add rootfs-dbg to PSEUDO_INCLUDE_PATHS
` [OE-core][wrynose 20/28] ffmpeg: Fix for CVE-2026-66037
` [OE-core][wrynose 21/28] ffmpeg: Fix for CVE-2026-66038
` [OE-core][wrynose 22/28] ffmpeg: Fix for CVE-2026-66039
` [OE-core][wrynose 23/28] sstate: Update mtime/atime for sig/siginfo files in sstate_checkhashes()
` [OE-core][wrynose 24/28] sstate: Update unpack touch code to be consistent
` [OE-core][wrynose 25/28] linux-yocto/6.18: rt: update to v6.18.37-rt6
` [OE-core][wrynose 26/28] linux-yocto/6.18: update to v6.18.50
` [OE-core][wrynose 27/28] linux-yocto/6.18: update to v6.18.52
` [OE-core][wrynose 28/28] linux-yocto/6.18: fix kernel reproducibility issues

[PATCH v3] tiff: add ptest support
 2026-09-27  7:32 UTC  (2+ messages)
  ` [OE-core] "

[OE-core][wrynose][PATCH 1/6] curl: Security Fix for CVE-2026-13608
 2026-09-27  6:35 UTC  (3+ messages)
` [OE-core][wrynose][PATCH 2/6] curl: Security Fix for CVE-2026-18924

[AUH] python3-meson-python: upgrading to 0.22.0 SUCCEEDED
 2026-09-27  5:16 UTC 

[AUH] gtk-doc: upgrading to 1.37.0 SUCCEEDED
 2026-09-27  5:16 UTC 

[AUH] Upgrade status: 2026-09-27
 2026-09-27  5:16 UTC 

[PATCH][wrynose] gnutls: upgrade 3.8.12 -> 3.8.13
 2026-09-26 20:49 UTC  (2+ messages)
` [OE-core] "

[wrynose][oe-core][PATCH 1/5] ffmpeg: Fix for CVE-2026-66036
 2026-09-26 20:37 UTC  (4+ messages)
` [wrynose][oe-core][PATCH 5/5] ffmpeg: Fix for CVE-2026-66041

[oe-core][PATCHv2] cpan: do not rebuild the Makefile when perls config is re-staged
 2026-09-26 19:11 UTC 

[oe-core][PATCH 1/5] gcr: initialize libgcrypt from the secret exchange
 2026-09-26 19:03 UTC  (11+ messages)
` [oe-core][PATCH 2/5] cpan: survive the Makefile that MakeMaker rebuilds under us
` [oe-core][PATCH 5/5] go-mod-update-modules: include the generated files from the class

[PATCH] kernel: use absolute paths in the kernel-image scripts
 2026-09-26 15:01 UTC  (2+ messages)

[PATCH] initramfs-framework: retry LABEL lookup before coldplug fallback
 2026-09-26 14:42 UTC  (2+ messages)

[OE-core][PATCH] libpcre2-ptest: add testoutput3C for locale variant
 2026-09-26 13:32 UTC  (2+ messages)

[PATCH wrynose 0/4] spdx: fix the compiled-sources filter
 2026-09-26  9:19 UTC  (2+ messages)
` [OE-core] "

[AUH] diffoscope: upgrading to 331 SUCCEEDED
 2026-09-26  5:25 UTC 

[AUH] python3-pbr: upgrading to 7.1.2 SUCCEEDED
 2026-09-26  5:25 UTC 

[AUH] Upgrade status: 2026-09-26
 2026-09-26  5:25 UTC 

[AUH] python3-markdown: upgrading to 3.11 SUCCEEDED
 2026-09-26  5:25 UTC 

[AUH] gdb-cross-canadian-x86-64,gdb,gdb-cross-x86_64: upgrading to 18.1 FAILED
 2026-09-26  5:25 UTC 

[OE-core][scarthgap 00/47] Pull request (cover letter only)
 2026-09-25 22:58 UTC 

[PATCH] compiler-rt: Use specific arm architecture instead of 'arm'
 2026-09-25 17:37 UTC  (2+ messages)
` [OE-core] "

[PATCH 1/2] sqlite3: Squash sqlite3.inc into the recipe
 2026-09-25 16:56 UTC  (2+ messages)
` [PATCH 2/2] sqlite3: Add support for the unlock notify API, and enable it for target

[PATCH] lame: add context to patches
 2026-09-25 14:52 UTC 

[PATCH 1/2] linux-yocto-dev: drop DeviceTree validation dependencies
 2026-09-25 13:10 UTC  (4+ messages)
` [PATCH 2/2] python3-dtschema-wrapper: remove obsolete recipe

[PATCH] gcr: remove now-redundant gnome_verdir() replacement
 2026-09-25 11:58 UTC 

[PATCH v2] gstreamer: skip test_queue:test_leaky_downstream test as it's flakey
 2026-09-25 10:53 UTC 

[OE-core][PATCH] wget: fix CVE-2026-15146
 2026-09-25 10:30 UTC 

[PATCH] clang/llvm: Upgrade to 23.1.2 release
 2026-09-25  9:21 UTC 

[PATCH] gstreamer: skip test_queue:test_leaky_downstream test as it's flakey
 2026-09-25  9:03 UTC 

[PATCH 1/2] rt-tests: drop Makefile CC/AR patch and use EXTRA_OEMAKE
 2026-09-25  8:20 UTC  (2+ messages)
` [PATCH] rt-tests/hwlatdetect: upgrade 2.10 -> 2.11

[AUH] Upgrade status: 2026-09-25
 2026-09-25  6:52 UTC 

[AUH] parted: upgrading to 3.8 SUCCEEDED
 2026-09-25  6:52 UTC 

[AUH] libpam: upgrading to 1.7.3 SUCCEEDED
 2026-09-25  6:52 UTC 

[AUH] libuv: upgrading to 1.53.0 SUCCEEDED
 2026-09-25  6:52 UTC 

[AUH] python3-uv-build: upgrading to 0.12.19 SUCCEEDED
 2026-09-25  6:52 UTC 

[AUH] epiphany: upgrading to 51.1 SUCCEEDED
 2026-09-25  6:52 UTC 

[scarthgap][PATCH] fs-util: try AT_EMPTY_PATH for access_fd() first
 2026-09-25  6:43 UTC  (3+ messages)
` [OE-core] "

[oe-core][PATCH] libx11: stage the X11 locale data in the native sysroot
 2026-09-25  6:42 UTC 

[OE-core][scarthgap][PATCH 5/6] libxml2: Security Fix for CVE-2026-86141
 2026-09-25  1:34 UTC  (2+ messages)

[PATCH] go: skip internal/cgrouptest when cpu.max is not available
 2026-09-25  2:22 UTC 

[PATCH] go: skip internal/cgrouptest when cpu.max is not available
 2026-09-25  1:48 UTC 

[PATCH] xxhash: inherit lib_package
 2026-09-24 17:16 UTC 

[PATCH 1/4] lib/oe/package: remove unused and optional fatal argument to source_info()
 2026-09-24 15:57 UTC  (4+ messages)
` [PATCH 2/4] elfutils: fix handling of DWARF5 compilation units
` [PATCH 3/4] classes/package: use eu-srcfiles instead of dwarfsrcfiles
` [PATCH 4/4] dwarfsrcfiles: remove

[OE-core][PATCH v1] util-linux: ptest: fix flock test timeout on slow targets
 2026-09-24 15:05 UTC  (2+ messages)

[PATCH] gcc: Fix configargs.h build arch contamination
 2026-09-24 14:17 UTC 

[PATCH v4] systemd: backport fix for limits.h override
 2026-09-24 13:33 UTC 

[PATCH v3] systemd: fix musl build by fixing limits.h override
 2026-09-24 13:00 UTC  (2+ messages)
` [OE-core] "

[OE-core[scarthgap][v2][PATCH 1/2] python3-pyasn1: fix CVE-2026-30922
 2026-09-24 12:15 UTC  (2+ messages)
` [OE-core][scarthgap][v2][PATCH 2/2] python3-pyasn1: fix CVE-2026-59885

[OE-core][PATCH] python3: ptest: skip flaky test_staggered_race_with_eager_tasks
 2026-09-24 11:43 UTC 

[OE-core][wrynose v2 00/78] Pull request (cover letter only)
 2026-09-24 11:39 UTC 

[PATCH] go-mod-update-modules: Combine env with fetcher environment
 2026-09-24 11:15 UTC 

[PATCH 0/3] nfs-utils: musl upgrade to 3.1.1 and prerequisite systemd fixes
 2026-09-24 10:59 UTC  (6+ messages)
` [PATCH v2 0/3] systemd musl build fixes and nfs-utils upgrade
  ` [PATCH v2 1/3] systemd: fix musl build by fixing limits.h override
    ` [OE-core] "
  ` [PATCH v2 2/3] systemd: dlopen-deps: only warn for missing required providers
    ` [OE-core] "

[OE-core][scarthgap][Patch 00/11] u-boot-tools: address multiple CVEs
 2026-09-24 10:56 UTC  (5+ messages)
` [OE-core][scarthgap][Patch 02/11] u-boot-tools: Ignore CVE-2024-42040
      ` [scarthgap][Patch "

[scarthgap][PATCH v2] glibc: Fix CVE-2026-6238
 2026-09-24  9:26 UTC 

[PATCH v2] kernel-fit-image: remove fatal error when .crt file is missing
 2026-09-24  9:23 UTC 

[PATCH] remove fatal error when .crt file is missing at fitimage sanity check
 2026-09-24  9:01 UTC  (2+ messages)
` Patchtest results for "

[OE-core][scarthgap][PATCH 1/3] curl: Security Fix for CVE-2026-13608
 2026-09-24  6:58 UTC  (3+ messages)
` [OE-core][scarthgap][PATCH 2/3] curl: Security Fix for CVE-2026-18924

[OE-core][scarthgap 00/48] Patch review
 2026-09-24  6:56 UTC  (4+ messages)
` [OE-core][scarthgap 46/48] curl: Security Fix for CVE-2026-18924

[PATCH] barebox: install generated dtbs
 2026-09-24  6:09 UTC 

[PATCH 1/2] devtool: ide-sdk: make nfs export script quicker
 2026-09-24  6:01 UTC  (2+ messages)
` [PATCH 2/2] devtool: ide-sdk: allow ide plugins to add packages rootfs-dbg

[AUH] python3-pytz: upgrading to 2026.4 SUCCEEDED
 2026-09-24  5:34 UTC 

[AUH] python3-setuptools-scm: upgrading to 10.3.4 FAILED
 2026-09-24  5:34 UTC 

[AUH] Upgrade status: 2026-09-24
 2026-09-24  5:34 UTC 

[AUH] shadow: upgrading to 4.20.3 FAILED
 2026-09-24  5:34 UTC 

[AUH] python3-vcs-versioning: upgrading to 2.5.0 SUCCEEDED
 2026-09-24  5:34 UTC 

[AUH] gnupg: upgrading to 2.5.24 SUCCEEDED
 2026-09-24  5:34 UTC 

[AUH] python3-wcwidth: upgrading to 0.9.1 SUCCEEDED
 2026-09-24  5:34 UTC 

[AUH] repo: upgrading to 2.68.1 SUCCEEDED
 2026-09-24  5:34 UTC 

[OE-core][PATCH 00/13] resulttool: add 'durations' subcommand and selftests
 2026-09-24  2:17 UTC  (15+ messages)
` [OE-core][PATCH 01/13] scripts: resulttool: add 'durations' option
` [OE-core][PATCH 02/13] selftest: resulttooltests.py: add basic durations test
` [OE-core][PATCH 03/13] selftest: resulttooltests.py: add report-log Time(s) column test
` [OE-core][PATCH 04/13] selftest: resulttooltests.py: add zero-round pct suppression test
` [OE-core][PATCH 05/13] selftest: resulttooltests.py: add consecutive-pair delta test
` [OE-core][PATCH 06/13] selftest: resulttooltests.py: add threshold filtering test
` [OE-core][PATCH 07/13] selftest: resulttooltests.py: add threshold-disabled test
` [OE-core][PATCH 08/13] selftest: resulttooltests.py: add multi-pair threshold test
` [OE-core][PATCH 09/13] selftest: resulttooltests.py: add None-pct "
` [OE-core][PATCH 10/13] selftest: resulttooltests.py: add sort-by-delta test
` [OE-core][PATCH 11/13] selftest: resulttooltests.py: add limit-after-sort test
` [OE-core][PATCH 12/13] selftest: resulttooltests.py: add short-tables ordering test
` [OE-core][PATCH 13/13] selftest: resulttooltests.py: add min-duration default test

Topic: native libstdc++ and uninative
 2026-09-23 21:31 UTC  (5+ messages)
` [OE-core] "

[PATCH v2 0/3] Fix kernel complementary package installation
 2026-09-23 20:51 UTC  (4+ messages)
` [PATCH v2 1/3] kernel.bbclass: make the -src package installable on purpose
` [PATCH v2 2/3] core-image.bbclass: do not pull the kernel -src package in via complementary packages
` [PATCH v2 3/3] oe/package.py: copydebugsources: add all kernel source files

[scarthgap][PATCH] u-boot-tools: use all patches from u-boot
 2026-09-23 17:38 UTC 

[PATCH 1/9] classes/cargo_common: move PKG_CONFIG_ALLOW_CROSS export to oe_cargo_fix_env
 2026-09-23 17:17 UTC  (5+ messages)
` [PATCH 8/9] classes/cargo-c: pass flags via CARGO_BUILD_FLAGS
  ` [OE-core] "

PATCH] coreutils: Upgrade 9.11 -> 9.12
 2026-09-23 16:58 UTC 


This is a public inbox, see mirroring instructions
for how to clone and mirror all data and code used for this inbox