messages from 2026-10-04 16:58:10 to 2026-10-07 20:14:21 UTC [more...]
[blacksail][PATCH] recipes-support/gnutls: disable slow tests for RISCV64
2026-10-06 9:47 UTC (2+ messages)
[PATCH] Revert "tclibc-baremetal.inc: fix gcc-cross EXTRA_OECONF"
2026-10-07 20:13 UTC (4+ messages)
` [OE-core] "
[wrynose][PATCH] glibc: set status for CVE-2026-86805 and CVE-2026-95818
2026-10-07 17:28 UTC
[PATCH 1/6] cups: upgrade 2.4.19 -> 2.4.20
2026-10-07 14:23 UTC (7+ messages)
` [PATCH 2/6] harfbuzz: upgrade 14.5.1 -> 14.6.0
` [PATCH 3/6] rpm-sequoia-crypto-policy: upgrade to latest revision
` [PATCH 4/6] python3-hypothesis: upgrade 6.168.3 -> 6.168.5
` [PATCH 5/6] python3-more-itertools: upgrade 10.8.0 -> 11.1.0
` [OE-core] "
` [PATCH 6/6] python3-rpds-py: upgrade 2026.6.3 -> 2026.9.1
[wrynose][oe-core][PATCH 1/5] ffmpeg: Fix for CVE-2026-66036
2026-10-07 12:29 UTC (6+ messages)
` [wrynose][oe-core][PATCH 5/5] ffmpeg: Fix for CVE-2026-66041
` [External] "
[OE-core][scarthgap][PATCH v2 5/5] curl: fix CVE-2026-7168
2026-10-07 11:48 UTC (5+ messages)
` [OE-core][scarthgap][PATCH v3 "
` [scarthgap][PATCH "
[OE-core][scarthgap][PATCH 1/6] curl: Fix CVE-2026-8286
2026-10-07 11:39 UTC (3+ messages)
` [scarthgap][PATCH "
[scarthgap][PATCH] vim: fix backport format for CVE-2026-73076
2026-10-07 11:25 UTC (3+ messages)
` [OE-core] "
[OE-core][scarthgap][PATCH 1/8] curl: set CVE_STATUS for CVE-2026-9547
2026-10-07 11:24 UTC (8+ messages)
` [OE-core][scarthgap][PATCH 2/8] curl: deferred CVE-2026-12064
` [OE-core][scarthgap][PATCH 3/8] curl: fix CVE-2026-8286
` [OE-core][scarthgap][PATCH 4/8] curl: ignore CVE-2026-8924
` [OE-core][scarthgap][PATCH 5/8] curl: fix CVE-2026-8927
` [OE-core][scarthgap][PATCH 6/8] curl: fix CVE-2026-8932
` [OE-core][scarthgap][PATCH 7/8] curl: fix CVE-2026-6429
` [OE-core][scarthgap][PATCH 8/8] curl: fix CVE-2026-7168
[scarthgap][PATCHv2] vim: Fix for CVE-2026-73076
2026-10-07 11:23 UTC
[wrynose][PATCH] glibc: stable 2.43 branch updates to 562cd7badd
2026-10-07 10:43 UTC (3+ messages)
` [OE-core] "
[PATCH] gcc: Fix for CVE-2026-102010
2026-10-07 10:27 UTC
[OE-core][scarthgap][PATCH v2] bison: fix CVE-2026-56390
2026-10-07 9:48 UTC
[OE-core][scarthgap 0/8] Pull request (cover letter only)
2026-10-07 8:52 UTC
[oe][meta-oe][scarthgap][PATCH v2 1/2] hdf5: Fix CVE-2026-17573
2026-10-07 8:50 UTC (2+ messages)
` [oe][meta-oe][scarthgap][PATCH v2 2/2] hdf5: Fix CVE-2026-17574
[PATCH] buildhistory-diff: fix handling of a missing previous build revision
2026-10-07 7:59 UTC
[OE-core][PATCH] avahi: add ptest support
2026-10-07 7:39 UTC (3+ messages)
` [OE-core][PATCH v2] "
[PATCH] libgcc: fix build for baremetal
2026-10-07 5:57 UTC
[AUH] python3-iniconfig: upgrading to 2.3.1 SUCCEEDED
2026-10-07 5:48 UTC
[AUH] log4cplus: upgrading to 2.2.1 SUCCEEDED
2026-10-07 5:48 UTC
[AUH] openssh: upgrading to 10.6p1 SUCCEEDED
2026-10-07 5:48 UTC
[AUH] python3-vcs-versioning: upgrading to 2.6.0 SUCCEEDED
2026-10-07 5:48 UTC
[AUH] llvm-project-source-23.1.2: upgrading to 23.1.3 FAILED
2026-10-07 5:48 UTC
[AUH] xserver-xorg: upgrading to 21.1.25 SUCCEEDED
2026-10-07 5:48 UTC
[AUH] xwayland: upgrading to 24.1.14 SUCCEEDED
2026-10-07 5:48 UTC
[AUH] Upgrade status: 2026-10-07
2026-10-07 5:48 UTC
[PATCH] openssh: Upgrade 10.5p1 -> 10.6p1
2026-10-07 5:45 UTC
[PATCH] tclibc-baremetal.inc: fix gcc-cross EXTRA_OECONF
2026-10-07 4:53 UTC (4+ messages)
` [OE-core] "
[OE-core][blacksail v2 00/18] Patch review
2026-10-06 20:43 UTC (19+ messages)
` [OE-core][blacksail v2 01/18] alsa-lib: patch CVE-2026-90781
` [OE-core][blacksail v2 02/18] go: skip internal/cgrouptest when cpu.max is not available
` [OE-core][blacksail v2 03/18] elfutils: fix handling of DWARF5 compilation units
` [OE-core][blacksail v2 04/18] bluez5: fix obexd/pbap u128_to_string skipping data[4]
` [OE-core][blacksail v2 05/18] libpcre2-ptest: add testoutput3C for locale variant
` [OE-core][blacksail v2 06/18] libpcre2: upgrade 10.48 -> 10.49
` [OE-core][blacksail v2 07/18] linux-yocto/6.18: update to v6.18.54
` [OE-core][blacksail v2 08/18] linux-yocto/7.2: update to v7.2.8
` [OE-core][blacksail v2 09/18] opkg: take the default architecture from the target CPU
` [OE-core][blacksail v2 10/18] opkg: update Upstream-Status for a merged patch
` [OE-core][blacksail v2 11/18] util-linux: update flock test patch Upstream-Status to Backport
` [OE-core][blacksail v2 12/18] perlcross: Upgrade 1.6.4 -> 1.6.5
` [OE-core][blacksail v2 13/18] perlcross: drop redundant LDFLAGS-when-linking-libperl patch
` [OE-core][blacksail v2 14/18] tzdata/tzcode-native: upgrade 2026d -> 2026e
` [OE-core][blacksail v2 15/18] python3-pytz: upgrade 2026.3.post1 -> 2026.4
` [OE-core][blacksail v2 16/18] python3-hypothesis: upgrade 6.168.0 -> 6.168.1
` [OE-core][blacksail v2 17/18] python3-hypothesis: upgrade 6.168.1 -> 6.168.3
` [OE-core][blacksail v2 18/18] recipes-support/gnutls: disable slow tests for RISCV64
[OE-core][blacksail 00/19] Patch review
2026-10-06 20:31 UTC (24+ messages)
` [OE-core][blacksail 01/19] alsa-lib: patch CVE-2026-90781
` [OE-core][blacksail 02/19] go: skip internal/cgrouptest when cpu.max is not available
` [OE-core][blacksail 03/19] elfutils: fix handling of DWARF5 compilation units
` [OE-core][blacksail 04/19] tclibc-baremetal.inc: fix gcc-cross EXTRA_OECONF
` [OE-core][blacksail 05/19] bluez5: fix obexd/pbap u128_to_string skipping data[4]
` [OE-core][blacksail 06/19] libpcre2-ptest: add testoutput3C for locale variant
` [OE-core][blacksail 07/19] libpcre2: upgrade 10.48 -> 10.49
` [OE-core][blacksail 08/19] linux-yocto/6.18: update to v6.18.54
` [OE-core][blacksail 09/19] linux-yocto/7.2: update to v7.2.8
` [OE-core][blacksail 10/19] opkg: take the default architecture from the target CPU
` [OE-core][blacksail 11/19] opkg: update Upstream-Status for a merged patch
` [OE-core][blacksail 12/19] util-linux: update flock test patch Upstream-Status to Backport
` [OE-core][blacksail 13/19] perlcross: Upgrade 1.6.4 -> 1.6.5
` [OE-core][blacksail 14/19] perlcross: drop redundant LDFLAGS-when-linking-libperl patch
` [OE-core][blacksail 15/19] tzdata/tzcode-native: upgrade 2026d -> 2026e
` [OE-core][blacksail 16/19] python3-pytz: upgrade 2026.3.post1 -> 2026.4
` [OE-core][blacksail 17/19] python3-hypothesis: upgrade 6.168.0 -> 6.168.1
` [OE-core][blacksail 18/19] python3-hypothesis: upgrade 6.168.1 -> 6.168.3
` [OE-core][blacksail 19/19] recipes-support/gnutls: disable slow tests for RISCV64
[PATCH 0/2] perlcross: Upgrade and drop redudant patch
2026-10-06 20:27 UTC (5+ messages)
` [PATCH 1/2] perlcross: Upgrade 1.6.4 -> 1.6.5
` [OE-core] "
[scarthgap][PATCH 1/6] expat: patch CVE-2026-66046 and CVE-2026-76641
2026-10-06 20:14 UTC (6+ messages)
` [scarthgap][PATCH 2/6] expat: patch CVE-2026-76956
` [scarthgap][PATCH 3/6] expat: patch CVE-2026-76957
` [scarthgap][PATCH 4/6] expat: patch CVE-2026-93990
` [scarthgap][PATCH 5/6] expat: patch CVE-2026-102633
` [scarthgap][PATCH 6/6] expat: patch CVE-2026-77214
[PATCH 1/3] systemd: Upgrade 261.3 -> 262
2026-10-06 19:37 UTC (4+ messages)
` [PATCH v3] "
` [PATCH v4] "
[wrynose][PATCH 1/6] expat: patch CVE-2026-66046 and CVE-2026-76641
2026-10-06 19:36 UTC (6+ messages)
` [wrynose][PATCH 2/6] expat: patch CVE-2026-76956
` [wrynose][PATCH 3/6] expat: patch CVE-2026-76957
` [wrynose][PATCH 4/6] expat: patch CVE-2026-93990
` [wrynose][PATCH 5/6] expat: patch CVE-2026-102633
` [wrynose][PATCH 6/6] expat: patch CVE-2026-77214
[OE-core][PATCH] nasm: fix CVE-2026-6067
2026-10-06 18:57 UTC
[PATCH] libsoup: set status of 4 CVEs
2026-10-06 17:29 UTC
[scarthgap][PATCH] libsolv: patch CVE-2026-48863
2026-10-06 16:42 UTC
[wrynose][PATCH] libsolv: patch CVE-2026-48863
2026-10-06 16:42 UTC
[blacksail][PATCH 1/2] popt: patch CVE-2026-18743
2026-10-06 16:01 UTC (2+ messages)
` [blacksail][PATCH 2/2] popt: patch CVE-2026-18739
[blacksail][PATCH] python3-mako: upgrade 1.4.1 -> 1.4.3
2026-10-06 16:01 UTC
Yocto Project Status 6 October 2026 (WW41)
2026-10-06 14:14 UTC
[PATCH] rust: Upgrade 1.98.1 -> 1.99.0
2026-10-06 12:06 UTC (3+ messages)
` [OE-core] "
[PATCH] rust-target-config: fix invalid +v5 LLVM feature for armv5
2026-10-06 11:56 UTC
[PATCH v2 0/2] rust: add rust-analyzer support
2026-10-06 11:12 UTC (3+ messages)
` [PATCH v2 1/2] rust: package rust-analyzer for the SDK
` [PATCH v2 2/2] packagegroup-rust-cross-canadian: add rust-analyzer to "
[RFC][oe-core][PATCH] libx11: stage the X11 locale data in the target sysroot
2026-10-06 10:47 UTC
[PATCH v2 1/3] qemu: enable pseudo for nfs rootfs export
2026-10-06 9:06 UTC (3+ messages)
` [PATCH v2 2/3] runqemu: support rootfs-dbg flag in QB_FSINFO
` [PATCH v2 3/3] selftest/runtime_test: add testimage.bbclass NFS rootfs-dbg test
[OE-core][PATCH v1] linux-firmware: package qcom-shikra-wifi firmware
2026-10-06 7:07 UTC
[AUH] python3-spdx-tools: upgrading to 0.8.5 FAILED
2026-10-06 6:24 UTC
[AUH] python3-subunit: upgrading to 1.4.6 FAILED
2026-10-06 6:24 UTC
[AUH] Upgrade status: 2026-10-06
2026-10-06 6:24 UTC
[AUH] python3-hypothesis: upgrading to 6.168.5 SUCCEEDED
2026-10-06 6:24 UTC
[AUH] python3-more-itertools: upgrading to 11.1.0 SUCCEEDED
2026-10-06 6:24 UTC
[AUH] cups: upgrading to 2.4.20 SUCCEEDED
2026-10-06 6:24 UTC
[AUH] harfbuzz: upgrading to 14.6.0 SUCCEEDED
2026-10-06 6:24 UTC
[AUH] python3-libarchive-c: upgrading to 5.3 FAILED
2026-10-06 6:24 UTC
[AUH] rpm-sequoia-crypto-policy: upgrading to 14a7b30a95489e38e63c61779e2410cbf5884613 SUCCEEDED
2026-10-06 6:24 UTC
[AUH] u-boot-tools,u-boot: upgrading to 2026.10 FAILED
2026-10-06 6:24 UTC
[AUH] expat: upgrading to 2.9.0 SUCCEEDED
2026-10-06 6:24 UTC
[PATCH] u-boot: upgrade 2026.07 -> 2026.10
2026-10-05 22:40 UTC
[PATCH] expat: Upgrade 2.8.5 -> 2.9.0
2026-10-05 22:08 UTC
[PATCH 0/2] mesa 26.2.4 upgrade and gallivm llvm 23 build fix
2026-10-05 18:36 UTC (3+ messages)
` [PATCH 1/2] mesa,mesa-tools-native: upgrade 26.2.3 -> 26.2.4
` [PATCH 2/2] mesa: gallivm llvm 23 build fix
[PATCH] maintainers.inc: volunteer to maintain a package
2026-10-05 19:34 UTC
[PATCH] gdb: Upgrade 17.2 -> 18.1
2026-10-05 19:19 UTC (3+ messages)
` [PATCH v2] "
[PATCH] packagegroup-core-tools-testapps: Drop Go tools on powerpc64
2026-10-05 17:10 UTC
[PATCH 0/2] Use GI_DATA_ENABLED for the python3-pygobject consumers
2026-10-05 16:54 UTC (3+ messages)
` [PATCH 1/2] blueprint-compiler: Skip on target when GI data is not available
` [PATCH 2/2] python3-dbusmock: Recommend python3-pygobject only with GI data
[scarthgap][PATCH 1/7] util-linux: patch CVE-2026-53614
2026-10-05 17:05 UTC (7+ messages)
` [scarthgap][PATCH 2/7] util-linux: patch CVE-2026-53613
` [scarthgap][PATCH 3/7] util-linux: patch CVE-2026-53612
` [scarthgap][PATCH 4/7] util-linux: patch CVE-2024-28085 regression
` [scarthgap][PATCH 5/7] util-linux: patch CVE-2026-78408
` [scarthgap][PATCH 6/7] util-linux: patch CVE-2026-78410
` [scarthgap][PATCH 7/7] util-linux: patch CVE-2026-76642
[PATCH] libpcre2: Remove testoutput3C file
2026-10-05 15:37 UTC
[PATCH 00/24] 2026-09-29 upgrades
2026-10-05 15:34 UTC (4+ messages)
` [PATCH 22/24] libpcre2: upgrade 10.48 -> 10.49
` [OE-core] "
[PATCH v4 0/1] recipes-support/gnutls: disable slow tests for RISCV64
2026-10-05 13:38 UTC (2+ messages)
` [PATCH v4 1/1] "
[PATCH] cmake: upgrade 4.4.3 -> 4.4.4
2026-10-05 12:17 UTC
[PATCH] libical: uprade 4.0.5 -> 4.0.6
2026-10-05 11:10 UTC
[PATCH v2] gtk4: upgrade 4.22.5 -> 4.24.0
2026-10-05 10:28 UTC
OE-core CVE metrics for blacksail on Mon Oct 05 10:01:25 2026
2026-10-05 10:15 UTC
[OE-core][scarthgap][PATCH v2 1/8] libxml2: Fix CVE-2026-86137
2026-10-05 9:23 UTC (8+ messages)
` [OE-core][scarthgap][PATCH v2 2/8] libxml2: Fix CVE-2026-86138
` [OE-core][scarthgap][PATCH v2 3/8] libxml2: mark CVE-2026-86139 fixed
` [OE-core][scarthgap][PATCH v2 4/8] libxml2: Fix CVE-2026-86140
` [OE-core][scarthgap][PATCH v2 5/8] libxml2: Fix CVE-2026-86141
` [OE-core][scarthgap][PATCH v2 6/8] libxml2: Fix CVE-2026-86142
` [OE-core][scarthgap][PATCH v2 7/8] libxml2: Fix CVE-2026-86143
` [OE-core][scarthgap][PATCH v2 8/8] libxml2: Fix CVE-2026-86144
[poky][scarthgap][PATCH] systemd: replace a bunch of assert() with friendlier checks
2026-10-05 8:46 UTC (3+ messages)
` [OE-core] "
[PATCH] opkg: update Upstream-Status for a merged patch
2026-10-05 8:44 UTC
[poky][scarthgap][PATCH v2] systemd: replace a bunch of assert() with friendlier checks
2026-10-05 8:22 UTC
[PATCH v4 0/3] spdx: add support to include releaseTime
2026-10-05 7:11 UTC (3+ messages)
` [OE-core] "
[PATCH] python3-cffi: move python3-setuptools to ptest
2026-10-05 7:01 UTC
[PATCH 1/3] sstate-cache-management: find work-shared stamps too
2026-10-05 6:53 UTC (3+ messages)
` [PATCH 2/3] sstate-cache-management: skip directories it cannot read
` [PATCH 3/3] sstate-cache-management: drop unused functions
[PATCH 0/4] Upgrades on 02-10-2026
2026-10-05 6:51 UTC (5+ messages)
` [PATCH 1/4] libjitterentropy: upgrade 3.6.3 -> 3.7.0
` [OE-core] "
[scarthgap][PATCHv2 1/2] glibc: Fix CVE-2026-5450
2026-10-05 5:56 UTC (2+ messages)
` [scarthgap][PATCHv2 2/2] glibc: Fix CVE-2026-5928
[AUH] lrzsz: upgrading to 0.13.1 FAILED
2026-10-05 5:28 UTC
[AUH] python3-hypothesis: upgrading to 6.168.4 SUCCEEDED
2026-10-05 5:28 UTC
[AUH] Upgrade status: 2026-10-05
2026-10-05 5:28 UTC
[AUH] python3-pycairo: upgrading to 1.29.2 SUCCEEDED
2026-10-05 5:28 UTC
[AUH] python3-wcwidth: upgrading to 0.9.2 SUCCEEDED
2026-10-05 5:28 UTC
[AUH] python3-rpds-py: upgrading to 2026.9.1 SUCCEEDED
2026-10-05 5:28 UTC
[AUH] python3-pycryptodomex,python3-pycryptodome: upgrading to 3.24.0 SUCCEEDED
2026-10-05 5:28 UTC
[AUH] fastfloat: upgrading to 8.3.1 SUCCEEDED
2026-10-05 5:28 UTC
OE-core CVE metrics for master on Mon Oct 05 03:05:09 2026
2026-10-05 3:54 UTC (3+ messages)
` OE-core CVE metrics for scarthgap on Mon Oct 05 03:04:01 2026
` OE-core CVE metrics for wrynose on Mon Oct 05 03:04:34 2026
[PATCH] externalsrc: fix PKGV for devtool build
2026-10-04 15:43 UTC (3+ messages)
` [OE-core] "
page: next (older) | prev (newer) | latest
- recent:[subjects (threaded)|topics (new)|topics (active)]
This is a public inbox, see mirroring instructions
for how to clone and mirror all data and code used for this inbox