messages from 2026-10-16 22:24:56 to 2026-10-20 09:29:39 UTC [more...]
[PATCH 0/7] Upgrades on 20th October
2026-10-20 9:29 UTC
[wrynose][PATCH 0/7] stable updates for wrynose
2026-10-20 9:21 UTC (9+ messages)
` [wrynose][PATCH 1/7] xz: upgrade 5.8.2 -> 5.8.4
` [wrynose][PATCH 2/7] glib-2.0-initial,glib-2.0: upgrade 2.88.2 -> 2.88.4
` [OE-core] "
` [wrynose][PATCH 3/7] python3: upgrade 3.14.7 -> 3.14.8
` [wrynose][PATCH 4/7] lttng-modules: upgrade 2.14.4 -> 2.14.7
` [wrynose][PATCH 5/7] lttng-tools: upgrade 2.14.1 -> 2.14.3
` [wrynose][PATCH 6/7] lttng-ust: upgrade 2.14.0 "
` [wrynose][PATCH 7/7] libgcrypt: upgrade 1.12.1 -> 1.12.4
[wrynose][PATCH] kernel-fit-image: reference the boot script as "script"
2026-10-20 9:18 UTC
[PATCH] python3-sphinx: update 9.1.0 -> 9.1.1
2026-10-20 9:04 UTC
[PATCH v2 RESEND] classes/archiver: fix tarball content in "original" mode
2026-10-20 8:01 UTC (6+ messages)
` [OE-core] "
[wrynose][PATCH 0/5] bluez5: fix AVDTP and OBEX issues
2026-10-20 7:58 UTC (11+ messages)
` [wrynose][PATCH 1/5] bluez5: Fix error handling for AVDTP_OPEN cmd
` [OE-core] "
` [wrynose][PATCH 2/5] bluez5: Fix GET_CONFIGURATION cmd
` [OE-core] "
` [wrynose][PATCH 3/5] bluez5: Return correct error when SEP is inuse
` [OE-core] "
` [wrynose][PATCH 4/5] bluez5: Fix ABORT response being discarded
` [OE-core] "
` [wrynose][PATCH 5/5] bluez5: Fix u128_to_string skipping data[4]
` [OE-core] "
[OE-core][PATCH v2] libsoup: add ptest support
2026-10-20 7:36 UTC (3+ messages)
` [OE-core][PATCH v3] "
[wrynose][PATCH v2] libarchive: fix CVE-2026-15028
2026-10-20 7:23 UTC (4+ messages)
` [OE-core] "
[AUH] python3-uv-build: upgrading to 0.13.3 SUCCEEDED
2026-10-20 7:13 UTC
[AUH] linux-firmware: upgrading to 20261019 FAILED
2026-10-20 7:13 UTC
[AUH] Upgrade status: 2026-10-20
2026-10-20 7:13 UTC
[AUH] python3-setuptools: upgrading to 84.2.0 SUCCEEDED
2026-10-20 7:13 UTC
[AUH] ethtool: upgrading to 7.2 SUCCEEDED
2026-10-20 7:13 UTC
[AUH] python3-websockets: upgrading to 17.3 SUCCEEDED
2026-10-20 7:13 UTC
[AUH] python3-sphinx: upgrading to 9.1.1 SUCCEEDED
2026-10-20 7:13 UTC
[AUH] python3-jsonpointer: upgrading to 3.4 SUCCEEDED
2026-10-20 7:13 UTC
[AUH] python3-markdown: upgrading to 3.11.2 SUCCEEDED
2026-10-20 7:13 UTC
[AUH] go-binary-native: upgrading to 1.27.3 SUCCEEDED
2026-10-20 7:13 UTC
[AUH] python3-hypothesis: upgrading to 6.170.5 SUCCEEDED
2026-10-20 7:13 UTC
[AUH] python3-certifi: upgrading to 2026.10.19 SUCCEEDED
2026-10-20 7:13 UTC
[AUH] elfutils: upgrading to 0.197 FAILED
2026-10-20 7:13 UTC
[AUH] weston: upgrading to 16.0.1 SUCCEEDED
2026-10-20 7:13 UTC
[AUH] python3-pycryptodome: upgrading to 4.1.0 SUCCEEDED
2026-10-20 7:13 UTC
[AUH] go-cross-x86-64-v3,go-cross-canadian-x86-64,go-runtime,go-crosssdk-x86_64-pokysdk-linux,go: upgrading to 1.27.3 FAILED
2026-10-20 7:13 UTC
[scarthgap][PATCHv4] vim: Fix for CVE-2026-73076
2026-10-20 6:16 UTC
[PATCH] clang: use Release instead of MinSizeRel
2026-10-20 6:10 UTC (4+ messages)
` [OE-core] "
[PATCH 1/2] libarchive: upgrade 3.8.9 -> 3.8.10
2026-10-20 6:10 UTC (4+ messages)
` [OE-core] "
` [PATCH v2 1/2] python3-libarchive-c: fix tests for libarchive 3.8.10
` [PATCH v2 2/2] libarchive: upgrade 3.8.9 -> 3.8.10
[scarthgap][PATCH] u-boot-tools: use all patches from u-boot
2026-10-20 5:16 UTC (3+ messages)
` [OE-core] "
[PATCH] clang: Fix crash with -fzero-call-used-regs on RISC-V large frames
2026-10-20 3:46 UTC (2+ messages)
` Patchtest results for "
[PATCH] libfyaml: Link with libatomic on targets lacking 64-bit atomics
2026-10-20 2:26 UTC (3+ messages)
` [OE-core] "
[PATCH] libfyaml: Detect the need for libatomic at configure time
2026-10-20 2:23 UTC
[PATCH 1/6] lib/oe/sstatesig: cache the user/group lookups in OEOuthashBasic
2026-10-20 2:05 UTC (7+ messages)
` [PATCH 2/6] lib/oe/cachedpath: add is_executable() functions
` [PATCH 3/6] lib/oe/package: use cachedpath.is_executable() instead of os.access()
` [PATCH 4/6] lib/oe/package: improve regex when looking for libraries
` [PATCH 5/6] lib/oe/package: use elfutils instead of objdump to extract SONAME etc
` [OE-core] "
` [PATCH 6/6] lib/oe/package: fix logic error in file permission checks
[PATCH] maintainers.inc: Update maintainer for systemd-tools-native
2026-10-19 19:18 UTC
[OE-core][wrynose][PATCH 00/10] openssh: Security fixes
2026-10-19 18:44 UTC (3+ messages)
` [OE-core][wrynose][PATCH 01/10] openssh: Fix CVE-2026-106584
[OE-core] [scarthgap] [PATCH] boost: make ICU support configurable
2026-10-19 18:37 UTC (2+ messages)
[OE-core][wrynose][patch] rsync: Security fixes from v3.4.1-sec-patches3
2026-10-19 18:31 UTC (10+ messages)
` [wrynose][patch] "
` [OE-core] "
[scarthgap][PATCH] python3-urllib3: Fix CVE-2026-97689
2026-10-19 18:18 UTC
[PATCH 0/7] riscv64 ptest fixes
2026-10-19 17:20 UTC (16+ messages)
` [PATCH 5/7] tcl, tcl8: skip binary-40.3 on RISC-V
` [OE-core] "
` [PATCH v2 0/8] riscv64 ptest fixes
` [PATCH v2 1/8] strace: skip qual_fault-syscall.test on riscv64
` [PATCH v2 2/8] ptest-packagelists.inc: re-enable strace for riscv64
` [PATCH v2 3/8] ptest-packagelists.inc: re-enable python3 "
` [PATCH v2 4/8] lttng-tools: skip kernel cases when kernel tests are disabled
` [PATCH v2 5/8] tcl, tcl8: anchor the musl unixInit-3 skip to top-level SKIP lines
` [OE-core] "
` [PATCH v2 6/8] tcl, tcl8: skip binary-40.3 on RISC-V
` [PATCH v2 7/8] ptest-packagelists.inc: re-enable tcl8 for riscv64
` [PATCH v2 8/8] python3-numpy: call libm for ceil/floor/trunc on riscv64
[PATCH 1/3] pkgconf: upgrade 3.0.8 -> 3.0.10
2026-10-19 17:10 UTC (3+ messages)
` [PATCH 2/3] python3-tomlkit: upgrade 0.15.1 -> 0.15.2
` [PATCH 3/3] libical: upgrade 4.0.6 -> 4.0.7
[master][blacksail][PATCH] stress-ng: Inherit pkgconfig
2026-10-19 16:29 UTC (4+ messages)
` [OE-core] "
[PATCH] pseudo: Pull in various fixes and logging improvements
2026-10-19 16:05 UTC (5+ messages)
` [OE-core] "
[scarthgap][PATCH 1/7] util-linux: patch CVE-2026-53614
2026-10-19 15:51 UTC (5+ messages)
` [scarthgap][PATCH 2/7] util-linux: patch CVE-2026-53613
` [OE-core] "
[qa-build-notification] QA notification for completed autobuilder build (yocto-5.0.21.rc1)
2026-10-19 15:26 UTC
[OE-core][scarthgap] linux-yocto/6.6: update to v6.6.157
2026-10-19 15:16 UTC (7+ messages)
[OE-core][wrynose][PATCH] sudo: fix CVE-2026-82474
2026-10-19 14:56 UTC (2+ messages)
[OE-core][wrynose][PATCH 1/3] busybox: fix CVE-2026-38752
2026-10-19 14:49 UTC (2+ messages)
[PATCH 0/3] yocto-check-layer: Faster BSP checks over many machines
2026-10-19 14:39 UTC (11+ messages)
` [PATCH 1/3] yocto-check-layer: Add --run-tests to select the tests to run
` [PATCH 2/3] yocto-check-layer: Skip initial signatures unless test_signatures runs
` [PATCH 3/3] checklayer: Reuse signatures of an identical successful world dump
` [PATCH v2 0/3] yocto-check-layer: Faster BSP checks over many machines
` [PATCH v2 1/3] yocto-check-layer: Add --run-tests to select the tests to run
` [PATCH v2 2/3] yocto-check-layer: Skip initial signatures unless test_signatures runs
` [PATCH v2 3/3] checklayer: Share each world signature dump between the tests needing it
[PATCH] rust: Squash rust-cross-canadian.inc into the recipe
2026-10-19 14:32 UTC (2+ messages)
` [OE-core] "
[Internal Review][OE-core][wrynose][PATCH 0/3] python3: upgrade to 3.14.8 and backport security fixes
2026-10-19 14:18 UTC (3+ messages)
` [OE-core][wrynose][PATCH 1/3] python3: upgrade 3.14.7 -> 3.14.8
[OE-core][wrynose][PATCH 1/3] lrzsz: fix CVE-2026-105841
2026-10-19 14:09 UTC (2+ messages)
[PATCH v2] erofs-utils: Make reproducible for different BUILD_ARCH
2026-10-19 14:04 UTC
[wrynose][PATCH] oeqa/selftest/devtool: handle existing patch directories in recipe tests
2026-10-19 12:58 UTC
[PATCH] oeqa/selftest/devtool: handle existing patch directories in recipe tests
2026-10-19 12:57 UTC
[OE-core][PATCH] mpfr: add ptest support
2026-10-19 13:05 UTC
[OE-core][wrynose][PATCH v3] u-boot: fix CVE-2026-29009
2026-10-19 12:39 UTC (3+ messages)
` [OE-core][wrynose][PATCH v4] "
[wrynose][PATCH] minicom: fix baud rate setting with glibc 2.42 and newer
2026-10-19 12:22 UTC (6+ messages)
` [OE-core] "
[OE-core][PATCH] boost: add lzma and zstd PACKAGECONFIG options
2026-10-19 11:16 UTC
[OE-core][wrynose][PATCH] boost: add lzma and zstd PACKAGECONFIG options
2026-10-19 11:00 UTC
[scarthgap][PATCHv3] vim: Fix for CVE-2026-73076
2026-10-19 12:19 UTC (2+ messages)
` [OE-core] "
[OE-core][scarthgap][PATCH 1/2] go: Fix CVE-2026-33814
2026-10-19 11:09 UTC (4+ messages)
[wrynose][PATCH] python3-urllib3: Fix CVE-2026-97689
2026-10-19 10:50 UTC
[OE-core][PATCH 1/5] sqlite3: upgrade 3.54.0 -> 3.54.1
2026-10-19 9:33 UTC (8+ messages)
` [OE-core][PATCH 2/5] librsvg: upgrade 2.63.2 -> 2.63.3
` [OE-core][PATCH 3/5] libnotify: upgrade 0.8.8 -> 0.8.9
` [OE-core][PATCH 4/5] libarchive: upgrade 3.8.9 -> 3.8.10
` [OE-core][PATCH 5/5] librepo: upgrade 1.21.1 -> 1.21.2
` [PATCH] "
[wrynose][PATCH] barebox: inherit upstream-stable-release-point
2026-10-19 9:23 UTC
[PATCH wrynose 1/7] initramfs-framework: add opt-in root-only udev trigger
2026-10-19 8:43 UTC (2+ messages)
[scarthgap][PATCHv2] vim: Fix for CVE-2026-73076
2026-10-19 8:42 UTC (3+ messages)
` [OE-core] "
[OE-core][PATCH] patch: add ptest support
2026-10-19 8:22 UTC (2+ messages)
` [OE-core][PATCH v2] "
[OE-core][wrynose][PATCH 0/5] curl: backport security fixes
2026-10-19 6:43 UTC (6+ messages)
` [OE-core][wrynose][PATCH 1/5] curl: fix CVE-2026-8926
` [OE-core][wrynose][PATCH 2/5] curl: fix CVE-2026-11564
` [OE-core][wrynose][PATCH 3/5] curl: fix CVE-2026-80255
` [OE-core][wrynose][PATCH 4/5] curl: fix CVE-2026-82208
` [OE-core][wrynose][PATCH 5/5] curl: fix CVE-2026-80231
[AUH] libunistring: upgrading to 1.5 SUCCEEDED
2026-10-19 6:02 UTC
[AUH] Upgrade status: 2026-10-19
2026-10-19 6:02 UTC
[AUH] pkgconf: upgrading to 3.0.10 SUCCEEDED
2026-10-19 6:02 UTC
[AUH] python3-pdm: upgrading to 2.29.3 SUCCEEDED
2026-10-19 6:02 UTC
[AUH] python3-certifi: upgrading to 2026.10.18 SUCCEEDED
2026-10-19 6:02 UTC
[AUH] less: upgrading to 710 SUCCEEDED
2026-10-19 6:02 UTC
[AUH] libical: upgrading to 4.0.7 SUCCEEDED
2026-10-19 6:02 UTC
[AUH] python3-hypothesis: upgrading to 6.170.2 SUCCEEDED
2026-10-19 6:02 UTC
[AUH] ccache: upgrading to 4.14.2 SUCCEEDED
2026-10-19 6:02 UTC
[AUH] python3-jsonpointer: upgrading to 3.3 SUCCEEDED
2026-10-19 6:02 UTC
OE-core CVE metrics for blacksail on Mon Oct 19 03:05:10 2026
2026-10-19 5:07 UTC (4+ messages)
` OE-core CVE metrics for master on Mon Oct 19 03:04:31 2026
` OE-core CVE metrics for scarthgap on Mon Oct 19 03:03:59 2026
` OE-core CVE metrics for wrynose on Mon Oct 19 03:05:10 2026
[wrynose][PATCH] curl: fix CVE-2026-80230
2026-10-18 22:02 UTC (3+ messages)
` [OE-core] "
[PATCH] oe.patch: fix Git note identity in commitIgnored
2026-10-18 19:53 UTC
[AUH] tcf-agent: upgrading to 1.11.1 FAILED
2026-10-18 5:33 UTC
[AUH] libnotify: upgrading to 0.8.9 SUCCEEDED
2026-10-18 5:33 UTC
[AUH] python3-pycryptodome: upgrading to 4.0.1 SUCCEEDED
2026-10-18 5:33 UTC
[AUH] python3-flit-core: upgrading to 4.1.0 SUCCEEDED
2026-10-18 5:33 UTC
[AUH] Upgrade status: 2026-10-18
2026-10-18 5:33 UTC
[PATCH 1/3] python3-sphinx: Add python3-compile to RDEPENDS
2026-10-17 18:25 UTC (3+ messages)
` [PATCH 2/3] python3-babel: Add python3-zoneinfo "
` [PATCH 3/3] python3-sphinxcontrib-applehelp: Add missing runtime dependencies
[PATCH] packagegroup-core-tools-testapps: Ignore gst-examples for rv32
2026-10-17 17:05 UTC
[PATCH v2 0/2] eudev: upgrade 3.2.14 -> 3.2.15
2026-10-17 16:01 UTC (3+ messages)
` [PATCH v2 1/2] base-passwd: add the render group for eudev-3.2.15
` [PATCH v2 2/2] eudev: upgrade 3.2.14 -> 3.2.15
[AUH] sqlite3: upgrading to 3.54.1 SUCCEEDED
2026-10-17 5:59 UTC
[AUH] python3-hypothesis: upgrading to 6.170.1 SUCCEEDED
2026-10-17 5:59 UTC
[AUH] Upgrade status: 2026-10-17
2026-10-17 5:59 UTC
[AUH] librsvg: upgrading to 2.63.3 SUCCEEDED
2026-10-17 5:59 UTC
[AUH] libubootenv: upgrading to 0.3.8 SUCCEEDED
2026-10-17 5:59 UTC
[AUH] systemd-boot,systemd-tools-native,systemd-boot-native,systemd: upgrading to 262.1 FAILED
2026-10-17 5:59 UTC
[AUH] libx11,libxi,libxrender,libxpm,libxtst: upgrading to 1.8.14,1.8.4,0.9.13,3.5.20,1.2.6 SUCCEEDED
2026-10-17 5:59 UTC
[OE-core][scarthgap 00/55] Pull request (cover letter only)
2026-10-16 22:51 UTC
[OE-core][blacksail 00/17] Patch review
2026-10-16 22:24 UTC (11+ messages)
` [OE-core][blacksail 08/17] glibc: stable 2.44 branch updates to 34106fee69
` [OE-core][blacksail 09/17] gcc: Fix for CVE-2026-102010
` [OE-core][blacksail 10/17] go: upgrade 1.27.1 -> 1.27.2
` [OE-core][blacksail 11/17] kea: Upgrade 3.2.0 -> 3.2.1
` [OE-core][blacksail 12/17] lib/oe/recipeutils: honor stable_upgrade for UPSTREAM_CHECK_COMMITS recipes
` [OE-core][blacksail 13/17] tcl: skip timing-sensitive clock tests
` [OE-core][blacksail 14/17] nasm: fix CVE-2026-6067
` [OE-core][blacksail 15/17] libpcre2: Remove testoutput3C file
` [OE-core][blacksail 16/17] sqlite3: Fix host include path leaking in with readline/editline
` [OE-core][blacksail 17/17] barebox: inherit upstream-stable-release-point
page: next (older) | prev (newer) | latest
- recent:[subjects (threaded)|topics (new)|topics (active)]
This is a public inbox, see mirroring instructions
for how to clone and mirror all data and code used for this inbox