messages from 2026-10-24 12:34:30 to 2026-10-28 07:04:06 UTC [more...]
[PATCH 0/8] Upgrades on 28th October
2026-10-28 7:03 UTC (6+ messages)
` [PATCH 1/8] cmake,cmake-native: upgrade 4.4.4 -> 4.4.5
` [PATCH 2/8] createrepo-c: upgrade 1.2.5 -> 1.2.6
` [PATCH 3/8] python3-pyasn1: upgrade 0.6.4 -> 0.6.5
` [PATCH 4/8] python3-pytest: upgrade 9.1.1 -> 9.2.0
` [PATCH 5/8] python3-flit-core: upgrade 3.12.0 -> 4.2.0
[AUH] Upgrade status: 2026-10-28
2026-10-28 6:06 UTC
[AUH] python3-pyasn1: upgrading to 0.6.5 SUCCEEDED
2026-10-28 6:06 UTC
[AUH] python3-pytest: upgrading to 9.2.0 SUCCEEDED
2026-10-28 6:06 UTC
[AUH] repo: upgrading to 2.71 SUCCEEDED
2026-10-28 6:06 UTC
[AUH] python3-hatchling: upgrading to 1.33.0 SUCCEEDED
2026-10-28 6:06 UTC
[AUH] libjpeg-turbo: upgrading to 3.2.1 FAILED
2026-10-28 6:06 UTC
[AUH] python3-flit-core: upgrading to 4.2.0 SUCCEEDED
2026-10-28 6:06 UTC
[AUH] createrepo-c: upgrading to 1.2.6 SUCCEEDED
2026-10-28 6:05 UTC
[AUH] cmake-native,cmake: upgrading to 4.4.5 SUCCEEDED
2026-10-28 6:05 UTC
[AUH] flex: upgrading to 2.6.5 FAILED
2026-10-28 6:05 UTC
[PATCH] musl: Keep clang from raising spurious FP exceptions
2026-10-28 5:19 UTC
[PATCH] lrzsz: Fix build with clang 23
2026-10-28 1:10 UTC
[OE-core][PATCH v4 00/10] Implement SPDX for deploy tasks
2026-10-27 22:47 UTC (21+ messages)
` [OE-core][PATCH v5 0/6] "
` [OE-core][PATCH v5 1/6] spdx: Skip dependencies that are not in the taskhash
` [OE-core][PATCH v5 2/6] spdx: Add ability for deploy tasks to create SPDX
` [OE-core][PATCH v5 3/6] oeqa: Add SPDX deploy SBoM test
` [OE-core][PATCH v5 4/6] classes-global/sstate: Keep SPDX generating setscene dependencies
` [OE-core][PATCH v5 5/6] Add SPDX deploy tasks to various recipes
` Patchtest results for "
` [OE-core][PATCH v5 6/6] spdx: Replace do_create_image_spdx with deploy task
` [OE-core][PATCH v6 0/7] Implement SPDX for deploy tasks
` [OE-core][PATCH v6 1/7] spdx: Skip dependencies that are not in the taskhash
` [OE-core][PATCH v6 2/7] spdx: Add ability for deploy tasks to create SPDX
` [OE-core][PATCH v6 3/7] oeqa: Add SPDX deploy SBoM test
` [OE-core][PATCH v6 4/7] classes-global/sstate: Keep SPDX generating setscene dependencies
` [OE-core][PATCH v6 5/7] classes-recipe/deploy: Add do_deploy to SPDX_DEPLOY_TASKS
` [OE-core][PATCH v6 6/7] spdx: Replace do_create_image_spdx with deploy task
` [OE-core][PATCH v6 7/7] layer.conf: Fix initramfs-framework not knowing which udev it has
[PATCH] clang: Remap lambda paths in declaration template arguments
2026-10-27 20:58 UTC
[PATCH] systemd-boot,systemd-tools-native,systemd-boot-native,systemd: upgrade 262 -> 262.1
2026-10-27 19:22 UTC (3+ messages)
` [OE-core] "
[PATCH] python3targetconfig: Do not add the current directory to PYTHONPATH
2026-10-27 19:17 UTC
[PATCH] openssl: Upgrade 4.0.3 -> 4.1.0
2026-10-27 18:34 UTC (4+ messages)
` [OE-core] "
` [PATCH v2 1/2] python3-cryptography: backport InvalidTag fix for openssl 4.1.0
` [PATCH v2 2/2] openssl: Upgrade 4.0.3 -> 4.1.0
[scarthgap][PATCH] boost: patch CVE-2023-34399
2026-10-27 18:27 UTC
[wrynose][PATCH] boost: patch CVE-2023-34399
2026-10-27 18:27 UTC
[blacksail][PATCH] boost: patch CVE-2023-34399
2026-10-27 18:27 UTC
[PATCH] boost: patch CVE-2023-34399
2026-10-27 18:27 UTC
[OE-core][PATCH] rpm: disable the RPM 6 script interpreter dependency generator
2026-10-27 16:14 UTC (4+ messages)
[PATCH] systemd: Improve detection of executables and libraries
2026-10-27 15:29 UTC
Yocto Project Status 27 October 2026 (WW44)
2026-10-27 14:45 UTC
[OE-core][scarthgap] linux-yocto/6.6: update to v6.6.157
2026-10-27 13:59 UTC (10+ messages)
[wrynose][PATCH] systemd: Upgrade 259.5 -> 259.10
2026-10-27 13:12 UTC (2+ messages)
SPDX 3.0 component releaseTime - clarification and areas for improvement
2026-10-27 12:27 UTC (2+ messages)
[PATCH 1/6] expat: use .tar.gz instead of .tar.bz2 in SRC_URI
2026-10-27 11:35 UTC (8+ messages)
` [PATCH 2/6] nasm: "
` [PATCH 3/6] mc: "
` [PATCH 4/6] tar: "
` [PATCH 5/6] gmp: "
` [PATCH 6/6] libexif: "
` [OE-core] [PATCH 1/6] expat: "
[PATCH v2 1/6] expat: use .tar.xz instead of .tar.bz2 in SRC_URI
2026-10-27 11:35 UTC (6+ messages)
` [PATCH v2 2/6] nasm: "
` [PATCH v2 3/6] mc: "
` [PATCH v2 4/6] tar: "
` [PATCH v2 5/6] gmp: "
` [PATCH v2 6/6] libexif: "
[PATCH 01/12] libsoup: upgrade 3.8.0 -> 3.8.1
2026-10-27 11:19 UTC (18+ messages)
` [PATCH 02/12] libsolv: upgrade 0.7.40 -> 0.7.41
` [PATCH 03/12] patch: upgrade 2.8 -> 2.8.1
` [PATCH 04/12] python3-certifi: upgrade 2026.10.19 -> 2026.10.23
` [PATCH 05/12] python3-cython: upgrade 3.2.9 -> 3.3.0
` [OE-core] "
` [PATCH 06/12] python3-hypothesis: upgrade 6.169.0 -> 6.170.9
` [PATCH 07/12] valgrind: upgrade 3.27.1 -> 3.28.0
` [PATCH 08/12] librsvg: upgrade 2.63.3 -> 2.63.4
` [PATCH 09/12] libslirp: upgrade 4.9.5 -> 4.9.6
` [PATCH 10/12] python3-jsonpointer: upgrade 3.4 -> 3.5
` [PATCH 11/12] python3-pycryptodome: upgrade 3.24.1 -> 4.2.0
` Patchtest results for "
` [PATCH v2] "
` [OE-core] [PATCH 11/12] "
` [PATCH 12/12] python3-wcwidth: upgrade 0.9.1 -> 0.9.4
[wrynose][PATCH] gcc: Fix for CVE-2026-95619
2026-10-27 11:09 UTC
[OE-core][wrynose 00/25] Pull request (cover letter only)
2026-10-27 10:41 UTC
[blacksail][PATCH] gcc: Fix for CVE-2026-95619
2026-10-27 10:30 UTC
[PATCH] gcc: Fix for CVE-2026-95619
2026-10-27 9:14 UTC
[PATCH v2] [wrynose][backport] bluez5: Abort continuing response on fragmented CT replies
2026-10-27 8:44 UTC (3+ messages)
` [OE-core] "
[PATCH 1/5] insane: fix unimplemented-ptest error handling
2026-10-27 8:12 UTC (5+ messages)
` [PATCH 2/5] uki.bbclass: use f-string for kernel-not-found error message
` [PATCH 3/5] uki.bbclass: remove unused glob import
` [PATCH 4/5] archiver.bbclass: fix format string argument mismatch in fatal message
` [PATCH 5/5] archiver.bbclass: remove unused shutil import
[AUH] Upgrade status: 2026-10-27
2026-10-27 5:40 UTC
[AUH] python3-jsonpointer: upgrading to 3.6 SUCCEEDED
2026-10-27 5:40 UTC
[AUH] python3-pdm: upgrading to 2.29.4 SUCCEEDED
2026-10-27 5:40 UTC
[AUH] python3-uv-build: upgrading to 0.13.6 SUCCEEDED
2026-10-27 5:40 UTC
[AUH] python3-hypothesis: upgrading to 6.170.12 SUCCEEDED
2026-10-27 5:40 UTC
[AUH] weston: upgrading to 16.0.2 SUCCEEDED
2026-10-27 5:40 UTC
[OE-core][PATCH 0/3] Fix incomplete license expressions being preferred over complete ones
2026-10-26 22:06 UTC (4+ messages)
` [OE-core][PATCH 1/3] lib/oe/license.py: Fix documentation of parse_legacy_license()
` [OE-core][PATCH 2/3] lib/oe/sbom.py: Fix partial licenses masking complete ones
` [OE-core][PATCH 3/3] lib/oe/sbom.py: Split deduplication of CreationInfo
[OE-core] [meta-networking][PATCH 1/2] squid: install systemd unit without executable bit
2026-10-26 17:49 UTC
[meta-networking][PATCH 1/2] squid: install systemd unit without executable bit
2026-10-26 17:46 UTC (4+ messages)
` [meta-networking][PATCH 2/2] squid: use /run instead of /var/run in tmpfiles.d
` Patchtest results for "
` Patchtest results for [meta-networking][PATCH 1/2] squid: install systemd unit without executable bit
[PATCH v2] rust-common: Use 64-bit time_t libc layouts for riscv32 musl
2026-10-26 17:29 UTC (2+ messages)
` [OE-core] "
[PATCH v3] tiff: add ptest support
2026-10-26 14:36 UTC (3+ messages)
` [PATCH v4] "
` [OE-core] "
[PATCH] python3: add comment about when a patch will be obsolete
2026-10-26 13:58 UTC
[PATCH 1/6] python3-hypothesis: upgrade 6.169.0 -> 6.170.8
2026-10-26 13:50 UTC (4+ messages)
` [PATCH 6/6] icu: Upgrade 78.3 -> 79.1
` [OE-core] "
` [PATCH v2] "
[PATCH 1/2] python3: remove obsolete musl test skipping
2026-10-26 13:37 UTC (2+ messages)
` [PATCH 2/2] python3: remove obsolete SKIPPED_TESTS
[PATCH] python3: upgrade 3.14.9 -> 3.14.10
2026-10-26 12:51 UTC
[PATCH] libunwind: update patch status
2026-10-26 12:45 UTC
[OE-core][PATCH] libsoup: ptest: reference upstream bug for skipped header-parsing-test
2026-10-26 12:38 UTC
[OE-core][PATCH] glib-2.0: ptest: skip memory-monitor-psi /dev/null test
2026-10-26 12:14 UTC
[OE-core][PATCH] python3: ptest: skip flaky test_shutdown_no_wait_max_tasks_gh119592
2026-10-26 11:47 UTC
[PATCH] python3: ptest: skip flaky test_shutdown_no_wait_max_tasks_gh119592
2026-10-26 11:42 UTC
[PATCH] rust: Squash rust-cross-canadian.inc into the recipe
2026-10-26 11:18 UTC (3+ messages)
` [OE-core] "
[PATCH 00/20] devtool: ide-sdk: add support for Rust recipes
2026-10-26 8:55 UTC (21+ messages)
` [PATCH 01/20] cargo-example: add minimal selftest fixture
` [PATCH 02/20] devtool: ide-sdk: capture Cargo cross environment
` [PATCH 03/20] devtool: ide-sdk: export recipe Cargo configuration
` [PATCH 04/20] devtool: ide-sdk: recommend Rust Analyzer for Cargo
` [PATCH 05/20] devtool: ide-sdk: configure "
` [PATCH 06/20] devtool: ide-sdk: share IntelliSense architecture mapping
` [PATCH 07/20] devtool: ide-sdk: configure Cargo C++ IntelliSense
` [PATCH 08/20] devtool: ide-sdk: generalize binary install task name
` [PATCH 09/20] devtool: ide-sdk: extract install task definition
` [PATCH 10/20] devtool: ide-sdk: order install after optional build task
` [PATCH 11/20] devtool: ide-sdk: add Cargo "
` [PATCH 12/20] devtool: ide-sdk: enforce LLDB for Cargo
` [PATCH 13/20] devtool: ide-sdk: parse Rust debug path remaps
` [PATCH 14/20] devtool: ide-sdk: remap Cargo sources for BitBake builds
` [PATCH 15/20] devtool: ide-sdk: map Cargo workspace sources for LLDB
` [PATCH 16/20] devtool: ide-sdk: map libstd-rs sources to Rust SDK
` [PATCH 17/20] oeqa/selftest: share source breakpoint lookup
` [PATCH 18/20] oeqa/selftest: run IDE tasks with configured environment
` [PATCH 19/20] oeqa/selftest: debug Cargo example over QEMU slirp
` [PATCH 20/20] oeqa/selftest: verify Cargo rebuild and redeploy
OE-core CVE metrics for blacksail on Mon Oct 26 04:05:38 2026
2026-10-26 7:52 UTC (4+ messages)
` OE-core CVE metrics for master on Mon Oct 26 04:04:41 2026
` OE-core CVE metrics for scarthgap on Mon Oct 26 04:04:19 2026
` OE-core CVE metrics for wrynose on Mon Oct 26 04:05:24 2026
[AUH] Upgrade status: 2026-10-26
2026-10-26 5:14 UTC
[AUH] python3: upgrading to 3.15.2 FAILED
2026-10-26 5:14 UTC
[AUH] python3-hypothesis: upgrading to 6.170.11 SUCCEEDED
2026-10-26 5:14 UTC
[AUH] libsoup: upgrading to 3.8.1 SUCCEEDED
2026-10-26 5:14 UTC
[PATCH 0/5] devtool: Support multiconfig workflows and fix kernel extraction
2026-10-26 0:09 UTC (2+ messages)
` [OE-core] "
[scarthgap][PATCH] python3: upgrade 3.12.15 -> 3.12.16
2026-10-25 21:13 UTC
[PATCH 1/2] devtool: ide-sdk: honor XDG_DATA_HOME for the CMake kits
2026-10-25 20:09 UTC (2+ messages)
` [PATCH 2/2] oe-selftest: devtool: do not add ide-sdk test kits to the user's "
[PATCH v5 0/6] uboot-sign: sign the SPL FIT configuration
2026-10-25 18:23 UTC (7+ messages)
` [PATCH v5 1/6] uboot-sign: add the option to sign SPL FIT configurations
` [PATCH v5 2/6] oe-selftest: fitimage: support new schema for uboot configuration signing
` [PATCH v5 3/6] oe-selftest: fitimage: check image vs. "
` [PATCH v5 4/6] oe-selftest: fitimage: test SPL FIT "
` [PATCH v5 5/6] uboot-sign: enable signing SPL FIT configuration
` [PATCH v5 6/6] oe-selftest: fitimage: test SPL FIT individual image signing
[PATCH v2 0/6] kernel-fit-image: add FIT_LOADABLE_* variables to do_compile vardeps
2026-10-25 18:18 UTC (7+ messages)
` [PATCH v2 1/6] "
` [PATCH v2 2/6] oeqa/selftest/esdk: pass only the image name to get_bb_vars
` [PATCH v2 3/6] oeqa/utils/commands: use tinfoil in get_bb_vars
` [PATCH v2 4/6] oeqa/utils/commands: support variable flags "
` [PATCH v2 5/6] oeqa/utils/commands: use the tinfoil helper in get_bb_var
` [PATCH v2 6/6] kernel-fit-image: drop the synthetic FIT_LOADABLE_* values
[PATCH] mesa: Fix TLSDESC detection on RISC-V
2026-10-25 16:30 UTC
[PATCH] qemuriscv64: Enable the Vector extension in the kernel
2026-10-25 16:03 UTC (3+ messages)
` [OE-core] "
[PATCH] kernel-fit-image: add FIT_LOADABLE_* variables to do_compile vardeps
2026-10-25 15:40 UTC (3+ messages)
` [OE-core] "
[AUH] Upgrade status: 2026-10-25
2026-10-25 5:18 UTC
[AUH] python3-wcwidth: upgrading to 0.9.4 SUCCEEDED
2026-10-25 5:18 UTC
[AUH] python3-jsonpointer: upgrading to 3.5 SUCCEEDED
2026-10-25 5:18 UTC
[AUH] libslirp: upgrading to 4.9.6 SUCCEEDED
2026-10-25 5:18 UTC
[AUH] python3-pycryptodome: upgrading to 4.2.0 SUCCEEDED
2026-10-25 5:18 UTC
[PATCH] elfutils: Fix backtrace ptests on musl
2026-10-24 17:31 UTC (2+ messages)
` [OE-core] "
[PATCH 1/3] consolekit: Upgrade to ConsoleKit2 2.0.0
2026-10-24 16:10 UTC (3+ messages)
` [PATCH 2/3] pulseaudio: Drop x11 requirement for consolekit RDEPENDS
` [PATCH 3/3] piglit: Fix build with glibc 2.43+ and clang
[PATCH v2 0/4] Add support for multiple kernels in FIT images
2026-10-24 13:42 UTC (7+ messages)
` [PATCH v2 1/4] oe.fitimage: Support multiple kernel nodes and configuration selection
` [OE-core] "
` [PATCH v2 3/4] oe.selftest: Add tests for multi-kernel FIT config
` [OE-core] "
` [PATCH v2 4/4] oe.fitimage: Add custom configurations and harden multi-kernel handling
` [OE-core] "
[PATCH RFC 0/3] sstate: Replay warnings and errors when restoring from sstate
2026-10-24 12:34 UTC (2+ messages)
` [PATCH RFC 3/3] oeqa/sstatetests: Add tests for sstate log replay
page: next (older) | prev (newer) | latest
- recent:[subjects (threaded)|topics (new)|topics (active)]
This is a public inbox, see mirroring instructions
for how to clone and mirror all data and code used for this inbox