From mboxrd@z Thu Jan 1 00:00:00 1970 Return-Path: Received: from mail-pf1-f181.google.com ([209.85.210.181]:44331 "EHLO mail-pf1-f181.google.com" rhost-flags-OK-OK-OK-OK) by vger.kernel.org with ESMTP id S1728624AbeHVRGu (ORCPT ); Wed, 22 Aug 2018 13:06:50 -0400 Received: by mail-pf1-f181.google.com with SMTP id k21-v6so987568pff.11 for ; Wed, 22 Aug 2018 06:41:53 -0700 (PDT) To: stable , Greg Kroah-Hartman From: Guenter Roeck Subject: Build failures in -stable queues Message-ID: <8c637c2e-e3bb-ae2a-6ef0-5986d221ecf2@roeck-us.net> Date: Wed, 22 Aug 2018 06:41:50 -0700 MIME-Version: 1.0 Content-Type: text/plain; charset=utf-8; format=flowed Content-Language: en-US Content-Transfer-Encoding: 8bit Sender: stable-owner@vger.kernel.org List-ID: v4.4.y, v4.9.y: Building mips:cavium_octeon_defconfig ... failed -------------- Error log: /opt/buildbot/slave/stable-queue-4.4/build/drivers/net/ethernet/octeon/octeon_mgmt.c: In function 'octeon_mgmt_change_mtu': /opt/buildbot/slave/stable-queue-4.4/build/drivers/net/ethernet/octeon/octeon_mgmt.c:652:6: error: 'size_without_fcs' undeclared v4.9.y, v4.14.y: Building i386:tools/perf ... failed Building x86_64:tools/perf ... failed -------------- Error log: PERF_VERSION = 4.9.123.g5175d5 tests/parse-events.c: In function ‘test_event’: tests/parse-events.c:1681:3: error: implicit declaration of function ‘parse_events_print_error’ [-Werror=implicit-function-declaration] parse_events_print_error(&err, e->name); ^ tests/parse-events.c:1681:3: error: nested extern declaration of ‘parse_events_print_error’ This is just a snapshot; builds are still ongoing. I'll send another e-mail later if more errors are reported after the build is complete. Guenter