* [thomas-weissschuh:b4/vdso-absolute-reloc 15/26] Diff in lib/vdso/check/vdsocheck.rs:41:
@ 2026-08-31 6:34 kernel test robot
0 siblings, 0 replies; only message in thread
From: kernel test robot @ 2026-08-31 6:34 UTC (permalink / raw)
To: Thomas Weißschuh ; +Cc: oe-kbuild-all
tree: https://git.kernel.org/pub/scm/linux/kernel/git/thomas.weissschuh/linux.git b4/vdso-absolute-reloc
head: 9df12e491e28d74ac27d382915c11e6675d9247e
commit: 978b910a0e9d188e9d4752dd43ae0a32972a5998 [15/26] x86/vdso: Enable the vdsocheck tool
config: x86_64-rhel-9.4-rust (https://download.01.org/0day-ci/archive/20260831/202608310810.SCyLJWK0-lkp@intel.com/config)
compiler: clang version 22.1.8 (https://github.com/llvm/llvm-project ca7933e47d3a3451d81e72ac174dcb5aa28b59d1)
rustc: rustc 1.96.0 (ac68faa20 2026-05-25)
reproduce (this is a W=1 build): (https://download.01.org/0day-ci/archive/20260831/202608310810.SCyLJWK0-lkp@intel.com/reproduce)
If you fix the issue in a separate patch/commit (i.e. not just a new version of
the same patch/commit), kindly add following tags
| Reported-by: kernel test robot <lkp@intel.com>
| Closes: https://lore.kernel.org/oe-kbuild-all/202608310810.SCyLJWK0-lkp@intel.com/
All errors (new ones prefixed by >>):
PATH=/opt/cross/clang-22/bin:/usr/local/bin:/usr/sbin:/usr/bin:/sbin:/bin
INFO PATH=/opt/cross/rustc-1.96.0-bindgen-0.72.1/cargo/bin:/opt/cross/clang-22/bin:/usr/local/bin:/usr/sbin:/usr/bin:/sbin:/bin
/usr/bin/timeout -k 100 12h /usr/bin/make KCFLAGS=\ -fno-crash-diagnostics\ -Wno-error=return-type\ -Wreturn-type\ -funsigned-char\ -Wundef\ -falign-functions=64 W=1 --keep-going LLVM=1 -j128 -C source O=/kbuild/obj/consumer/x86_64-rhel-9.4-rust ARCH=x86_64 SHELL=/bin/bash rustfmtcheck
make: Entering directory '/kbuild/src'
make[1]: Entering directory '/kbuild/obj/consumer/x86_64-rhel-9.4-rust'
>> Diff in lib/vdso/check/vdsocheck.rs:41:
bindings::R_386_GOTPC,
],
..Default::default()
- }.into(),
+ }
+ .into(),
bindings::EM_X86_64 => AllowedRelocations {
in_object_file: &[bindings::R_X86_64_PC32, bindings::R_X86_64_PLT32],
..Default::default()
Diff in lib/vdso/check/vdsocheck.rs:48:
- }.into(),
+ }
+ .into(),
_ => None,
}
}
make[2]: *** [Makefile:2057: rustfmt] Error 123
make[2]: Target 'rustfmtcheck' not remade because of errors.
make[1]: Leaving directory '/kbuild/obj/consumer/x86_64-rhel-9.4-rust'
make[1]: *** [Makefile:248: __sub-make] Error 2
make[1]: Target 'rustfmtcheck' not remade because of errors.
make: *** [Makefile:248: __sub-make] Error 2
make: Target 'rustfmtcheck' not remade because of errors.
make: Leaving directory '/kbuild/src'
--
0-DAY CI Kernel Test Service
https://github.com/intel/lkp-tests/wiki
^ permalink raw reply [flat|nested] only message in thread
only message in thread, other threads:[~2026-08-31 6:34 UTC | newest]
Thread overview: (only message) (download: mbox.gz follow: Atom feed
-- links below jump to the message on this page --
2026-08-31 6:34 [thomas-weissschuh:b4/vdso-absolute-reloc 15/26] Diff in lib/vdso/check/vdsocheck.rs:41: kernel test robot
This is an external index of several public inboxes,
see mirroring instructions on how to clone and mirror
all data and code used by this external index.