All of lore.kernel.org
 help / color / mirror / Atom feed
* [jpirko-mlxsw:wip_attestation_pre_rfc_draft1 13/26] drivers/ctlv/tests/metadata_kunit.c:17:10: fatal error: linux/ctlv_fixture_child_gen.h: No such file or directory
@ 2026-09-30  1:19 kernel test robot
  0 siblings, 0 replies; only message in thread
From: kernel test robot @ 2026-09-30  1:19 UTC (permalink / raw)
  To: Jiri Pirko; +Cc: oe-kbuild-all

tree:   https://github.com/jpirko/linux_mlxsw wip_attestation_pre_rfc_draft1
head:   a18af4e1b514bf11f88ca42d29b7b68f3b375378
commit: 7a94cd6833db466aa5cf2896495ef3692cd75429 [13/26] ctlv: Add the KUnit tests as their own module
config: arm-randconfig-r2306-20260930 (https://download.01.org/0day-ci/archive/20260930/202609300302.suAqTdXM-lkp@intel.com/config)
compiler: arm-linux-gnueabi-gcc (GCC) 8.5.0
sparse: v0.6.5-rc1
reproduce (this is a W=1 build): (https://download.01.org/0day-ci/archive/20260930/202609300302.suAqTdXM-lkp@intel.com/reproduce)

If you fix the issue in a separate patch/commit (i.e. not just a new version of
the same patch/commit), kindly add following tags
| Reported-by: kernel test robot <lkp@intel.com>
| Closes: https://lore.kernel.org/oe-kbuild-all/202609300302.suAqTdXM-lkp@intel.com/

All error/warnings (new ones prefixed by >>):

>> cc1: warning: kbuild/src/drivers/ctlv/tests: No such file or directory [-Wmissing-include-dirs]
--
>> cc1: warning: kbuild/src/drivers/ctlv/tests: No such file or directory [-Wmissing-include-dirs]
>> drivers/ctlv/tests/metadata_kunit.c:17:10: fatal error: linux/ctlv_fixture_child_gen.h: No such file or directory
    #include <linux/ctlv_fixture_child_gen.h>
             ^~~~~~~~~~~~~~~~~~~~~~~~~~~~~~~~
   compilation terminated.
--
>> cc1: warning: kbuild/src/drivers/ctlv/tests: No such file or directory [-Wmissing-include-dirs]
>> drivers/ctlv/tests/event_kunit.c:18:10: fatal error: linux/ctlv_fixture_gen.h: No such file or directory
    #include <linux/ctlv_fixture_gen.h>
             ^~~~~~~~~~~~~~~~~~~~~~~~~~
   compilation terminated.
--
>> cc1: warning: kbuild/src/drivers/ctlv/tests: No such file or directory [-Wmissing-include-dirs]
>> drivers/ctlv/tests/registration_kunit.c:25:10: fatal error: linux/ctlv_fixture_child_gen.h: No such file or directory
    #include <linux/ctlv_fixture_child_gen.h>
             ^~~~~~~~~~~~~~~~~~~~~~~~~~~~~~~~
   compilation terminated.
--
>> cc1: warning: kbuild/src/drivers/ctlv/tests: No such file or directory [-Wmissing-include-dirs]
>> drivers/ctlv/tests/message_kunit.c:18:10: fatal error: linux/ctlv_fixture_gen.h: No such file or directory
    #include <linux/ctlv_fixture_gen.h>
             ^~~~~~~~~~~~~~~~~~~~~~~~~~
   compilation terminated.


vim +17 drivers/ctlv/tests/metadata_kunit.c

  > 17	#include <linux/ctlv_fixture_child_gen.h>
    18	#include <linux/ctlv_fixture_gen.h>
    19	#include <linux/log2.h>
    20	#include <linux/minmax.h>
    21	#include <linux/string.h>
    22	#include <linux/types.h>
    23	

--
0-DAY CI Kernel Test Service
https://github.com/intel/lkp-tests/wiki

^ permalink raw reply	[flat|nested] only message in thread

only message in thread, other threads:[~2026-09-30  1:20 UTC | newest]

Thread overview: (only message) (download: mbox.gz follow: Atom feed
-- links below jump to the message on this page --
2026-09-30  1:19 [jpirko-mlxsw:wip_attestation_pre_rfc_draft1 13/26] drivers/ctlv/tests/metadata_kunit.c:17:10: fatal error: linux/ctlv_fixture_child_gen.h: No such file or directory kernel test robot

This is an external index of several public inboxes,
see mirroring instructions on how to clone and mirror
all data and code used by this external index.