* [linux-next:master 17266/17613] Makefile:66: exec selftests: skipping binfmt_misc_bpf, needs clang, bpftool, vmlinux BTF and libbpf
@ 2026-10-15 18:41 kernel test robot
0 siblings, 0 replies; only message in thread
From: kernel test robot @ 2026-10-15 18:41 UTC (permalink / raw)
To: oe-kbuild; +Cc: lkp
::::::
:::::: Manual check reason: "low confidence bisect report"
:::::: Manual check reason: "only suspicious fbc files changed"
::::::
BCC: lkp@intel.com
CC: oe-kbuild-all@lists.linux.dev
TO: Sasha Levin <sashal@kernel.org>
CC: Kees Cook <kees@kernel.org>
tree: https://git.kernel.org/pub/scm/linux/kernel/git/next/linux-next.git master
head: b810335a0699d1810683796b0e3ffe8827ddfe6c
commit: b36b990c50b1f581b9a7f35ae256f5542415fa69 [17266/17613] selftests/exec: report the skipped binfmt_misc_bpf test on stderr
:::::: branch date: 3 hours ago
:::::: commit date: 14 hours ago
config: s390-allnoconfig-bpf (https://download.01.org/0day-ci/archive/20261015/202610152043.ouH5myeG-lkp@intel.com/config)
compiler: s390x-linux-gnu-gcc (Debian 14.2.0-19) 14.2.0
reproduce (this is a W=1 build): (https://download.01.org/0day-ci/archive/20261015/202610152043.ouH5myeG-lkp@intel.com/reproduce)
If you fix the issue in a separate patch/commit (i.e. not just a new version of
the same patch/commit), kindly add following tags
| Reported-by: kernel test robot <lkp@intel.com>
| Closes: https://lore.kernel.org/r/202610152043.ouH5myeG-lkp@intel.com/
Note: the linux-next/master HEAD b810335a0699d1810683796b0e3ffe8827ddfe6c builds fine.
It may have been fixed somewhere.
All errors (new ones prefixed by >>):
make[1]: *** [../../lib.mk:225: tools/testing/selftests/drivers/net/psp_responder] Error 1
make[1]: Target 'all' not remade because of errors.
>> Makefile:66: exec selftests: skipping binfmt_misc_bpf, needs clang, bpftool, vmlinux BTF and libbpf
make[1]: *** [Makefile:117: tools/testing/selftests/hid/host-tools/sbin/bpftool] Error 2
make[1]: Target 'all' not remade because of errors.
make[1]: *** No targets. Stop.
make[1]: *** [../lib.mk:225: tools/testing/selftests/net/busy_poller] Error 1
make[1]: *** [../lib.mk:224: tools/testing/selftests/net/tun] Error 1
make[1]: Target 'all' not remade because of errors.
Makefile:60: warning: overriding recipe for target 'emit_tests'
../lib.mk:182: warning: ignoring old recipe for target 'emit_tests'
make[1]: *** No targets. Stop.
make[1]: *** [../lib.mk:224: tools/testing/selftests/proc/proc-loadavg-001] Error 1
make[1]: *** [../lib.mk:224: tools/testing/selftests/proc/proc-pid-vm] Error 1
make[1]: *** [../lib.mk:224: tools/testing/selftests/proc/proc-tid0] Error 1
make[1]: *** [../lib.mk:224: tools/testing/selftests/proc/setns-dcache] Error 1
make[1]: *** [../lib.mk:224: tools/testing/selftests/proc/setns-sysvipc] Error 1
make[1]: *** [../lib.mk:224: tools/testing/selftests/proc/thread-self] Error 1
make[1]: Target 'all' not remade because of errors.
make[1]: *** No targets specified and no makefile found. Stop.
make[1]: Circular tools/testing/selftests/rseq/param_test <- tools/testing/selftests/rseq/param_test dependency dropped.
make[1]: Circular tools/testing/selftests/rseq/param_test_compare_twice <- tools/testing/selftests/rseq/param_test dependency dropped.
make[1]: Circular tools/testing/selftests/rseq/param_test_compare_twice <- tools/testing/selftests/rseq/param_test_compare_twice dependency dropped.
make[1]: Circular tools/testing/selftests/rseq/param_test_mm_cid <- tools/testing/selftests/rseq/param_test dependency dropped.
make[1]: Circular tools/testing/selftests/rseq/param_test_mm_cid <- tools/testing/selftests/rseq/param_test_compare_twice dependency dropped.
make[1]: Circular tools/testing/selftests/rseq/param_test_mm_cid <- tools/testing/selftests/rseq/param_test_mm_cid dependency dropped.
make[1]: Circular tools/testing/selftests/rseq/param_test_mm_cid_compare_twice <- tools/testing/selftests/rseq/param_test dependency dropped.
make[1]: Circular tools/testing/selftests/rseq/param_test_mm_cid_compare_twice <- tools/testing/selftests/rseq/param_test_compare_twice dependency dropped.
make[1]: Circular tools/testing/selftests/rseq/param_test_mm_cid_compare_twice <- tools/testing/selftests/rseq/param_test_mm_cid dependency dropped.
make[1]: Circular tools/testing/selftests/rseq/param_test_mm_cid_compare_twice <- tools/testing/selftests/rseq/param_test_mm_cid_compare_twice dependency dropped.
make[1]: Circular tools/testing/selftests/rseq/syscall_errors_test <- tools/testing/selftests/rseq/param_test dependency dropped.
make[1]: Circular tools/testing/selftests/rseq/syscall_errors_test <- tools/testing/selftests/rseq/param_test_compare_twice dependency dropped.
make[1]: Circular tools/testing/selftests/rseq/syscall_errors_test <- tools/testing/selftests/rseq/param_test_mm_cid dependency dropped.
make[1]: Circular tools/testing/selftests/rseq/syscall_errors_test <- tools/testing/selftests/rseq/param_test_mm_cid_compare_twice dependency dropped.
make[1]: Circular tools/testing/selftests/rseq/syscall_errors_test <- tools/testing/selftests/rseq/syscall_errors_test dependency dropped.
make[1]: Circular tools/testing/selftests/rseq/legacy_check <- tools/testing/selftests/rseq/param_test dependency dropped.
make[1]: Circular tools/testing/selftests/rseq/legacy_check <- tools/testing/selftests/rseq/param_test_compare_twice dependency dropped.
make[1]: Circular tools/testing/selftests/rseq/legacy_check <- tools/testing/selftests/rseq/param_test_mm_cid dependency dropped.
make[1]: Circular tools/testing/selftests/rseq/legacy_check <- tools/testing/selftests/rseq/param_test_mm_cid_compare_twice dependency dropped.
make[1]: Circular tools/testing/selftests/rseq/legacy_check <- tools/testing/selftests/rseq/syscall_errors_test dependency dropped.
make[1]: Circular tools/testing/selftests/rseq/legacy_check <- tools/testing/selftests/rseq/legacy_check dependency dropped.
make[1]: Circular tools/testing/selftests/rseq/slice_test <- tools/testing/selftests/rseq/param_test dependency dropped.
make[1]: Circular tools/testing/selftests/rseq/slice_test <- tools/testing/selftests/rseq/param_test_compare_twice dependency dropped.
make[1]: Circular tools/testing/selftests/rseq/slice_test <- tools/testing/selftests/rseq/param_test_mm_cid dependency dropped.
make[1]: Circular tools/testing/selftests/rseq/slice_test <- tools/testing/selftests/rseq/param_test_mm_cid_compare_twice dependency dropped.
make[1]: Circular tools/testing/selftests/rseq/slice_test <- tools/testing/selftests/rseq/syscall_errors_test dependency dropped.
make[1]: Circular tools/testing/selftests/rseq/slice_test <- tools/testing/selftests/rseq/legacy_check dependency dropped.
make[1]: Circular tools/testing/selftests/rseq/slice_test <- tools/testing/selftests/rseq/slice_test dependency dropped.
make[1]: Circular tools/testing/selftests/rseq/check_optimized <- tools/testing/selftests/rseq/param_test dependency dropped.
make[1]: Circular tools/testing/selftests/rseq/check_optimized <- tools/testing/selftests/rseq/param_test_compare_twice dependency dropped.
make[1]: Circular tools/testing/selftests/rseq/check_optimized <- tools/testing/selftests/rseq/param_test_mm_cid dependency dropped.
make[1]: Circular tools/testing/selftests/rseq/check_optimized <- tools/testing/selftests/rseq/param_test_mm_cid_compare_twice dependency dropped.
make[1]: Circular tools/testing/selftests/rseq/check_optimized <- tools/testing/selftests/rseq/syscall_errors_test dependency dropped.
make[1]: Circular tools/testing/selftests/rseq/check_optimized <- tools/testing/selftests/rseq/legacy_check dependency dropped.
make[1]: Circular tools/testing/selftests/rseq/check_optimized <- tools/testing/selftests/rseq/slice_test dependency dropped.
make[1]: Circular tools/testing/selftests/rseq/check_optimized <- tools/testing/selftests/rseq/check_optimized dependency dropped.
make[1]: *** [Makefile:67: tools/testing/selftests/rseq/param_test_mm_cid_compare_twice] Error 1
make[1]: Target 'all' not remade because of errors.
make[1]: *** No targets. Stop.
make[1]: *** No targets. Stop.
vim +66 Makefile
3812b8c5c5d527 Masahiro Yamada 2019-02-22 59
066b7ed9558087 Michal Marek 2014-07-04 60 # Beautify output
066b7ed9558087 Michal Marek 2014-07-04 61 # ---------------------------------------------------------------------------
066b7ed9558087 Michal Marek 2014-07-04 62 #
8962b6b475bddc Masahiro Yamada 2022-12-23 63 # Most of build commands in Kbuild start with "cmd_". You can optionally define
8962b6b475bddc Masahiro Yamada 2022-12-23 64 # "quiet_cmd_*". If defined, the short log is printed. Otherwise, no log from
8962b6b475bddc Masahiro Yamada 2022-12-23 65 # that command is printed by default.
066b7ed9558087 Michal Marek 2014-07-04 @66 #
8962b6b475bddc Masahiro Yamada 2022-12-23 67 # e.g.)
8962b6b475bddc Masahiro Yamada 2022-12-23 68 # quiet_cmd_depmod = DEPMOD $(MODLIB)
8962b6b475bddc Masahiro Yamada 2022-12-23 69 # cmd_depmod = $(srctree)/scripts/depmod.sh $(DEPMOD) $(KERNELRELEASE)
066b7ed9558087 Michal Marek 2014-07-04 70 #
066b7ed9558087 Michal Marek 2014-07-04 71 # A simple variant is to prefix commands with $(Q) - that's useful
066b7ed9558087 Michal Marek 2014-07-04 72 # for commands that shall be hidden in non-verbose mode.
066b7ed9558087 Michal Marek 2014-07-04 73 #
8962b6b475bddc Masahiro Yamada 2022-12-23 74 # $(Q)$(MAKE) $(build)=scripts/basic
066b7ed9558087 Michal Marek 2014-07-04 75 #
6ae4b9868a8f72 Masahiro Yamada 2022-12-23 76 # If KBUILD_VERBOSE contains 1, the whole command is echoed.
6ae4b9868a8f72 Masahiro Yamada 2022-12-23 77 # If KBUILD_VERBOSE contains 2, the reason for rebuilding is printed.
066b7ed9558087 Michal Marek 2014-07-04 78 #
^1da177e4c3f41 Linus Torvalds 2005-04-16 79 # To put more focus on warnings, be less verbose as default
^1da177e4c3f41 Linus Torvalds 2005-04-16 80 # Use 'make V=1' to see the full commands
^1da177e4c3f41 Linus Torvalds 2005-04-16 81
:::::: The code at line 66 was first introduced by commit
:::::: 066b7ed9558087a7957a1128f27d7a3462ff117f kbuild: Do not print the build directory with make -s
:::::: TO: Michal Marek <mmarek@suse.cz>
:::::: CC: Michal Marek <mmarek@suse.cz>
--
0-DAY CI Kernel Test Service
https://github.com/intel/lkp-tests/wiki
^ permalink raw reply [flat|nested] only message in thread
only message in thread, other threads:[~2026-10-15 18:41 UTC | newest]
Thread overview: (only message) (download: mbox.gz follow: Atom feed
-- links below jump to the message on this page --
2026-10-15 18:41 [linux-next:master 17266/17613] Makefile:66: exec selftests: skipping binfmt_misc_bpf, needs clang, bpftool, vmlinux BTF and libbpf kernel test robot
This is an external index of several public inboxes,
see mirroring instructions on how to clone and mirror
all data and code used by this external index.