* [mszeredi-fuse:for-next 29/52] make[1]: *** No rule to make target 'fuse_symlink_cache_test.c', needed by 'tools/testing/selftests/filesystems/fuse/fuse_symlink_cache_test'.
@ 2026-10-18 7:46 kernel test robot
0 siblings, 0 replies; only message in thread
From: kernel test robot @ 2026-10-18 7:46 UTC (permalink / raw)
To: oe-kbuild; +Cc: lkp
::::::
:::::: Manual check reason: "low confidence bisect report"
::::::
BCC: lkp@intel.com
CC: oe-kbuild-all@lists.linux.dev
CC: fuse-devel@lists.sourceforge.net
TO: Luis Henriques <luis@igalia.com>
CC: Miklos Szeredi <mszeredi@redhat.com>
CC: Amir Goldstein <amir73il@gmail.com>
tree: https://git.kernel.org/pub/scm/linux/kernel/git/mszeredi/fuse.git for-next
head: 4dd8d396740168f5379f332ad2c165d7f0f91953
commit: 3e14f079d7a0af6308072d530dc45795ab437be1 [29/52] selftests/fuse: add fuse symlink caching test
:::::: branch date: 15 hours ago
:::::: commit date: 2 days ago
config: i386-allnoconfig-bpf (https://download.01.org/0day-ci/archive/20261017/202610170822.oEJ1Autq-lkp@intel.com/config)
compiler: gcc-14 (Debian 14.2.0-19) 14.2.0
reproduce (this is a W=1 build): (https://download.01.org/0day-ci/archive/20261017/202610170822.oEJ1Autq-lkp@intel.com/reproduce)
If you fix the issue in a separate patch/commit (i.e. not just a new version of
the same patch/commit), kindly add following tags
| Reported-by: kernel test robot <lkp@intel.com>
| Closes: https://lore.kernel.org/r/202610170822.oEJ1Autq-lkp@intel.com/
Note: the mszeredi-fuse/for-next HEAD 4dd8d396740168f5379f332ad2c165d7f0f91953 builds fine.
It only hurts bisectability.
All errors (new ones prefixed by >>):
make[1]: *** No rule to make target 'tools/testing/selftests/filesystems/fuse/test_syncfs', needed by 'all'.
>> make[1]: *** No rule to make target 'fuse_symlink_cache_test.c', needed by 'tools/testing/selftests/filesystems/fuse/fuse_symlink_cache_test'.
make[1]: *** [../../lib.mk:225: tools/testing/selftests/filesystems/fuse/fuse_mnt] Error 1
make[1]: *** [../../lib.mk:225: tools/testing/selftests/filesystems/fuse/fuse_acl_cache_test] Error 1
make[1]: *** [../../lib.mk:225: tools/testing/selftests/filesystems/fuse/fusectl_test] Error 1
make[1]: *** [../../lib.mk:225: tools/testing/selftests/filesystems/fuse/write_extend_eof_test] Error 1
make[1]: Target 'all' not remade because of errors.
make[1]: *** [Makefile:117: tools/testing/selftests/hid/tools/sbin/bpftool] Error 2
make[1]: Target 'all' not remade because of errors.
Makefile:60: warning: overriding recipe for target 'emit_tests'
../lib.mk:182: warning: ignoring old recipe for target 'emit_tests'
make[1]: *** No targets specified and no makefile found. Stop.
make[1]: Circular tools/testing/selftests/rseq/param_test <- tools/testing/selftests/rseq/param_test dependency dropped.
make[1]: Circular tools/testing/selftests/rseq/param_test_compare_twice <- tools/testing/selftests/rseq/param_test dependency dropped.
make[1]: Circular tools/testing/selftests/rseq/param_test_compare_twice <- tools/testing/selftests/rseq/param_test_compare_twice dependency dropped.
make[1]: Circular tools/testing/selftests/rseq/param_test_mm_cid <- tools/testing/selftests/rseq/param_test dependency dropped.
make[1]: Circular tools/testing/selftests/rseq/param_test_mm_cid <- tools/testing/selftests/rseq/param_test_compare_twice dependency dropped.
make[1]: Circular tools/testing/selftests/rseq/param_test_mm_cid <- tools/testing/selftests/rseq/param_test_mm_cid dependency dropped.
make[1]: Circular tools/testing/selftests/rseq/param_test_mm_cid_compare_twice <- tools/testing/selftests/rseq/param_test dependency dropped.
make[1]: Circular tools/testing/selftests/rseq/param_test_mm_cid_compare_twice <- tools/testing/selftests/rseq/param_test_compare_twice dependency dropped.
make[1]: Circular tools/testing/selftests/rseq/param_test_mm_cid_compare_twice <- tools/testing/selftests/rseq/param_test_mm_cid dependency dropped.
make[1]: Circular tools/testing/selftests/rseq/param_test_mm_cid_compare_twice <- tools/testing/selftests/rseq/param_test_mm_cid_compare_twice dependency dropped.
make[1]: Circular tools/testing/selftests/rseq/syscall_errors_test <- tools/testing/selftests/rseq/param_test dependency dropped.
make[1]: Circular tools/testing/selftests/rseq/syscall_errors_test <- tools/testing/selftests/rseq/param_test_compare_twice dependency dropped.
make[1]: Circular tools/testing/selftests/rseq/syscall_errors_test <- tools/testing/selftests/rseq/param_test_mm_cid dependency dropped.
make[1]: Circular tools/testing/selftests/rseq/syscall_errors_test <- tools/testing/selftests/rseq/param_test_mm_cid_compare_twice dependency dropped.
make[1]: Circular tools/testing/selftests/rseq/syscall_errors_test <- tools/testing/selftests/rseq/syscall_errors_test dependency dropped.
make[1]: Circular tools/testing/selftests/rseq/legacy_check <- tools/testing/selftests/rseq/param_test dependency dropped.
make[1]: Circular tools/testing/selftests/rseq/legacy_check <- tools/testing/selftests/rseq/param_test_compare_twice dependency dropped.
make[1]: Circular tools/testing/selftests/rseq/legacy_check <- tools/testing/selftests/rseq/param_test_mm_cid dependency dropped.
make[1]: Circular tools/testing/selftests/rseq/legacy_check <- tools/testing/selftests/rseq/param_test_mm_cid_compare_twice dependency dropped.
make[1]: Circular tools/testing/selftests/rseq/legacy_check <- tools/testing/selftests/rseq/syscall_errors_test dependency dropped.
make[1]: Circular tools/testing/selftests/rseq/legacy_check <- tools/testing/selftests/rseq/legacy_check dependency dropped.
make[1]: Circular tools/testing/selftests/rseq/slice_test <- tools/testing/selftests/rseq/param_test dependency dropped.
make[1]: Circular tools/testing/selftests/rseq/slice_test <- tools/testing/selftests/rseq/param_test_compare_twice dependency dropped.
make[1]: Circular tools/testing/selftests/rseq/slice_test <- tools/testing/selftests/rseq/param_test_mm_cid dependency dropped.
make[1]: Circular tools/testing/selftests/rseq/slice_test <- tools/testing/selftests/rseq/param_test_mm_cid_compare_twice dependency dropped.
make[1]: Circular tools/testing/selftests/rseq/slice_test <- tools/testing/selftests/rseq/syscall_errors_test dependency dropped.
make[1]: Circular tools/testing/selftests/rseq/slice_test <- tools/testing/selftests/rseq/legacy_check dependency dropped.
make[1]: Circular tools/testing/selftests/rseq/slice_test <- tools/testing/selftests/rseq/slice_test dependency dropped.
make[1]: Circular tools/testing/selftests/rseq/check_optimized <- tools/testing/selftests/rseq/param_test dependency dropped.
make[1]: Circular tools/testing/selftests/rseq/check_optimized <- tools/testing/selftests/rseq/param_test_compare_twice dependency dropped.
make[1]: Circular tools/testing/selftests/rseq/check_optimized <- tools/testing/selftests/rseq/param_test_mm_cid dependency dropped.
make[1]: Circular tools/testing/selftests/rseq/check_optimized <- tools/testing/selftests/rseq/param_test_mm_cid_compare_twice dependency dropped.
make[1]: Circular tools/testing/selftests/rseq/check_optimized <- tools/testing/selftests/rseq/syscall_errors_test dependency dropped.
make[1]: Circular tools/testing/selftests/rseq/check_optimized <- tools/testing/selftests/rseq/legacy_check dependency dropped.
make[1]: Circular tools/testing/selftests/rseq/check_optimized <- tools/testing/selftests/rseq/slice_test dependency dropped.
make[1]: Circular tools/testing/selftests/rseq/check_optimized <- tools/testing/selftests/rseq/check_optimized dependency dropped.
--
0-DAY CI Kernel Test Service
https://github.com/intel/lkp-tests/wiki
^ permalink raw reply [flat|nested] only message in thread
only message in thread, other threads:[~2026-10-18 7:52 UTC | newest]
Thread overview: (only message) (download: mbox.gz follow: Atom feed
-- links below jump to the message on this page --
2026-10-18 7:46 [mszeredi-fuse:for-next 29/52] make[1]: *** No rule to make target 'fuse_symlink_cache_test.c', needed by 'tools/testing/selftests/filesystems/fuse/fuse_symlink_cache_test' kernel test robot
This is an external index of several public inboxes,
see mirroring instructions on how to clone and mirror
all data and code used by this external index.