All of lore.kernel.org
 help / color / mirror / Atom feed
From: bluez.test.bot@gmail.com
To: linux-bluetooth@vger.kernel.org, loic.poulain@oss.qualcomm.com
Subject: RE: arm64: dts: monaco-arduino-monza: Add support for LGA WiFi/BT module
Date: Mon, 05 Oct 2026 06:01:47 -0700 (PDT)	[thread overview]
Message-ID: <6ac39fbb.edd3b74b.8e035.44ad@mx.google.com> (raw)
In-Reply-To: <20261005-monza-wireless-v7-1-5a6de7662dcb@oss.qualcomm.com>

[-- Attachment #1: Type: text/plain, Size: 11564 bytes --]

This is automated email and please do not reply to this email!

Dear submitter,

Thank you for submitting the patches to the linux bluetooth mailing list.
This is a CI test results with your patch series:
PW Link:https://patchwork.kernel.org/series/1179616/

---Test result---

Test Summary:
CheckPatch                    PASS      5.40 seconds
VerifyFixes                   PASS      0.09 seconds
VerifySignedoff               PASS      0.09 seconds
GitLint                       FAIL      2.19 seconds
SubjectPrefix                 FAIL      0.71 seconds
BuildKernel                   FAIL      23.74 seconds
CheckAllWarning               FAIL      26.98 seconds
CheckSparse                   FAIL      29.70 seconds
BuildKernel32                 FAIL      25.13 seconds
CheckKernelLLVM               FAIL      27.74 seconds
TestRunnerSetup               FAIL      758.78 seconds
TestRunner_l2cap-tester       FAIL      0.10 seconds
TestRunner_iso-tester         FAIL      0.12 seconds
TestRunner_bnep-tester        FAIL      0.10 seconds
TestRunner_mgmt-tester        FAIL      0.25 seconds
TestRunner_rfcomm-tester      FAIL      0.10 seconds
TestRunner_sco-tester         FAIL      0.10 seconds
TestRunner_ioctl-tester       FAIL      0.09 seconds
TestRunner_mesh-tester        FAIL      0.10 seconds
TestRunner_smp-tester         FAIL      0.10 seconds
TestRunner_userchan-tester    FAIL      0.10 seconds
TestRunner_6lowpan-tester     FAIL      0.10 seconds
IncrementalBuild              FAIL      31.81 seconds

Details
##############################
Test: GitLint - FAIL
Desc: Run gitlint
Output:
[v7,3/8] Bluetooth: hci_qca: Set 'bt_en_available' based on pwrseq power controllability

1: T1 Title exceeds max length (88>80): "[v7,3/8] Bluetooth: hci_qca: Set 'bt_en_available' based on pwrseq power controllability"
##############################
Test: SubjectPrefix - FAIL
Desc: Check subject contains "Bluetooth" prefix
Output:
"Bluetooth: " prefix is not specified in the subject
"Bluetooth: " prefix is not specified in the subject
##############################
Test: BuildKernel - FAIL
Desc: Build Kernel for Bluetooth
Output:

drivers/bluetooth/hci_qca.c: In function ‘qca_serdev_probe’:
drivers/bluetooth/hci_qca.c:2557:35: error: implicit declaration of function ‘pwrseq_is_controllable’ [-Wimplicit-function-declaration]
 2557 |                 bt_en_available = pwrseq_is_controllable(qcadev->pwrseq);
      |                                   ^~~~~~~~~~~~~~~~~~~~~~
make[4]: *** [scripts/Makefile.build:290: drivers/bluetooth/hci_qca.o] Error 1
make[3]: *** [scripts/Makefile.build:551: drivers/bluetooth] Error 2
make[2]: *** [scripts/Makefile.build:551: drivers] Error 2
make[2]: *** Waiting for unfinished jobs....
make[1]: *** [/home/runner/work/bluetooth-next/bluetooth-next/src/src/Makefile:2229: .] Error 2
make: *** [Makefile:248: __sub-make] Error 2
##############################
Test: CheckAllWarning - FAIL
Desc: Run linux kernel with all warning enabled
Output:

drivers/bluetooth/hci_qca.c: In function ‘qca_serdev_probe’:
drivers/bluetooth/hci_qca.c:2557:35: error: implicit declaration of function ‘pwrseq_is_controllable’ [-Wimplicit-function-declaration]
 2557 |                 bt_en_available = pwrseq_is_controllable(qcadev->pwrseq);
      |                                   ^~~~~~~~~~~~~~~~~~~~~~
make[4]: *** [scripts/Makefile.build:290: drivers/bluetooth/hci_qca.o] Error 1
make[4]: *** Waiting for unfinished jobs....
make[3]: *** [scripts/Makefile.build:551: drivers/bluetooth] Error 2
make[2]: *** [scripts/Makefile.build:551: drivers] Error 2
make[2]: *** Waiting for unfinished jobs....
make[1]: *** [/home/runner/work/bluetooth-next/bluetooth-next/src/src/Makefile:2229: .] Error 2
make: *** [Makefile:248: __sub-make] Error 2
##############################
Test: CheckSparse - FAIL
Desc: Run sparse tool with linux kernel
Output:

net/bluetooth/hci_event.c: note: in included file (through include/net/bluetooth/hci_core.h):
./include/net/bluetooth/hci.h:2975:47: warning: array of flexible structures
./include/net/bluetooth/hci.h:3061:43: warning: array of flexible structures
drivers/bluetooth/hci_qca.c: In function ‘qca_serdev_probe’:
drivers/bluetooth/hci_qca.c:2557:35: error: implicit declaration of function ‘pwrseq_is_controllable’ [-Wimplicit-function-declaration]
 2557 |                 bt_en_available = pwrseq_is_controllable(qcadev->pwrseq);
      |                                   ^~~~~~~~~~~~~~~~~~~~~~
make[4]: *** [scripts/Makefile.build:290: drivers/bluetooth/hci_qca.o] Error 1
make[4]: *** Waiting for unfinished jobs....
make[3]: *** [scripts/Makefile.build:551: drivers/bluetooth] Error 2
make[2]: *** [scripts/Makefile.build:551: drivers] Error 2
make[2]: *** Waiting for unfinished jobs....
net/bluetooth/hci_codec.c: note: in included file:
./include/net/bluetooth/hci_core.h:151:35: warning: array of flexible structures
net/bluetooth/sco.c: note: in included file:
./include/net/bluetooth/hci_core.h:151:35: warning: array of flexible structures
make[1]: *** [/home/runner/work/bluetooth-next/bluetooth-next/src/src/Makefile:2229: .] Error 2
make: *** [Makefile:248: __sub-make] Error 2
##############################
Test: BuildKernel32 - FAIL
Desc: Build 32bit Kernel for Bluetooth
Output:

drivers/bluetooth/hci_qca.c: In function ‘qca_serdev_probe’:
drivers/bluetooth/hci_qca.c:2557:35: error: implicit declaration of function ‘pwrseq_is_controllable’ [-Wimplicit-function-declaration]
 2557 |                 bt_en_available = pwrseq_is_controllable(qcadev->pwrseq);
      |                                   ^~~~~~~~~~~~~~~~~~~~~~
make[4]: *** [scripts/Makefile.build:290: drivers/bluetooth/hci_qca.o] Error 1
make[3]: *** [scripts/Makefile.build:551: drivers/bluetooth] Error 2
make[2]: *** [scripts/Makefile.build:551: drivers] Error 2
make[2]: *** Waiting for unfinished jobs....
make[1]: *** [/home/runner/work/bluetooth-next/bluetooth-next/src/src/Makefile:2229: .] Error 2
make: *** [Makefile:248: __sub-make] Error 2
##############################
Test: CheckKernelLLVM - FAIL
Desc: Build kernel with LLVM + context analysis
Output:

drivers/bluetooth/hci_qca.c:2557:21: error: call to undeclared function 'pwrseq_is_controllable'; ISO C99 and later do not support implicit function declarations [-Wimplicit-function-declaration]
 2557 |                 bt_en_available = pwrseq_is_controllable(qcadev->pwrseq);
      |                                   ^
1 error generated.
make[4]: *** [scripts/Makefile.build:290: drivers/bluetooth/hci_qca.o] Error 1
make[4]: *** Waiting for unfinished jobs....
make[3]: *** [scripts/Makefile.build:551: drivers/bluetooth] Error 2
make[2]: *** [scripts/Makefile.build:551: drivers] Error 2
make[2]: *** Waiting for unfinished jobs....
make[1]: *** [/home/runner/work/bluetooth-next/bluetooth-next/src/src/Makefile:2229: .] Error 2
make: *** [Makefile:248: __sub-make] Error 2
##############################
Test: TestRunnerSetup - FAIL
Desc: Setup kernel and bluez for test-runner
Output:
Kernel: 
drivers/bluetooth/hci_qca.c: In function ‘qca_serdev_probe’:
drivers/bluetooth/hci_qca.c:2557:35: error: implicit declaration of function ‘pwrseq_is_controllable’ [-Wimplicit-function-declaration]
 2557 |                 bt_en_available = pwrseq_is_controllable(qcadev->pwrseq);
      |                                   ^~~~~~~~~~~~~~~~~~~~~~
make[4]: *** [scripts/Makefile.build:290: drivers/bluetooth/hci_qca.o] Error 1
make[3]: *** [scripts/Makefile.build:551: drivers/bluetooth] Error 2
make[3]: *** Waiting for unfinished jobs....
make[2]: *** [scripts/Makefile.build:551: drivers] Error 2
make[1]: *** [/home/runner/work/bluetooth-next/bluetooth-next/src/src/Makefile:2229: .] Error 2
make: *** [Makefile:248: __sub-make] Error 2
##############################
Test: TestRunner_l2cap-tester - FAIL
Desc: Run l2cap-tester with test-runner
Output:

No kernel image found
##############################
Test: TestRunner_iso-tester - FAIL
Desc: Run iso-tester with test-runner
Output:

No kernel image found
##############################
Test: TestRunner_bnep-tester - FAIL
Desc: Run bnep-tester with test-runner
Output:

No kernel image found
##############################
Test: TestRunner_mgmt-tester - FAIL
Desc: Run mgmt-tester with test-runner
Output:

No kernel image found
##############################
Test: TestRunner_rfcomm-tester - FAIL
Desc: Run rfcomm-tester with test-runner
Output:

No kernel image found
##############################
Test: TestRunner_sco-tester - FAIL
Desc: Run sco-tester with test-runner
Output:

No kernel image found
##############################
Test: TestRunner_ioctl-tester - FAIL
Desc: Run ioctl-tester with test-runner
Output:

No kernel image found
##############################
Test: TestRunner_mesh-tester - FAIL
Desc: Run mesh-tester with test-runner
Output:

No kernel image found
##############################
Test: TestRunner_smp-tester - FAIL
Desc: Run smp-tester with test-runner
Output:

No kernel image found
##############################
Test: TestRunner_userchan-tester - FAIL
Desc: Run userchan-tester with test-runner
Output:

No kernel image found
##############################
Test: TestRunner_6lowpan-tester - FAIL
Desc: Run 6lowpan-tester with test-runner
Output:

No kernel image found
##############################
Test: IncrementalBuild - FAIL
Desc: Incremental build with the patches in the series
Output:

drivers/bluetooth/hci_qca.c: In function ‘qca_serdev_probe’:
drivers/bluetooth/hci_qca.c:2562:35: error: implicit declaration of function ‘pwrseq_is_controllable’ [-Wimplicit-function-declaration]
 2562 |                 bt_en_available = pwrseq_is_controllable(qcadev->bt_power->pwrseq);
      |                                   ^~~~~~~~~~~~~~~~~~~~~~
drivers/bluetooth/hci_qca.c:2569:25: error: implicit declaration of function ‘pwrseq_power_on’ [-Wimplicit-function-declaration]
 2569 |                         pwrseq_power_on(qcadev->bt_power->pwrseq);
      |                         ^~~~~~~~~~~~~~~
make[4]: *** [scripts/Makefile.build:290: drivers/bluetooth/hci_qca.o] Error 1
make[3]: *** [scripts/Makefile.build:551: drivers/bluetooth] Error 2
make[2]: *** [scripts/Makefile.build:551: drivers] Error 2
make[1]: *** [/home/runner/work/bluetooth-next/bluetooth-next/src/src/Makefile:2229: .] Error 2
make: *** [Makefile:248: __sub-make] Error 2
[v7,3/8] Bluetooth: hci_qca: Set 'bt_en_available' based on pwrseq power controllability

drivers/bluetooth/hci_qca.c: In function ‘qca_serdev_probe’:
drivers/bluetooth/hci_qca.c:2562:35: error: implicit declaration of function ‘pwrseq_is_controllable’ [-Wimplicit-function-declaration]
 2562 |                 bt_en_available = pwrseq_is_controllable(qcadev->bt_power->pwrseq);
      |                                   ^~~~~~~~~~~~~~~~~~~~~~
drivers/bluetooth/hci_qca.c:2569:25: error: implicit declaration of function ‘pwrseq_power_on’ [-Wimplicit-function-declaration]
 2569 |                         pwrseq_power_on(qcadev->bt_power->pwrseq);
      |                         ^~~~~~~~~~~~~~~
make[4]: *** [scripts/Makefile.build:290: drivers/bluetooth/hci_qca.o] Error 1
make[3]: *** [scripts/Makefile.build:551: drivers/bluetooth] Error 2
make[2]: *** [scripts/Makefile.build:551: drivers] Error 2
make[1]: *** [/home/runner/work/bluetooth-next/bluetooth-next/src/src/Makefile:2229: .] Error 2
make: *** [Makefile:248: __sub-make] Error 2


https://github.com/bluez/bluetooth-next/pull/862

---
Regards,
Linux Bluetooth


  parent reply	other threads:[~2026-10-05 13:01 UTC|newest]

Thread overview: 24+ messages / expand[flat|nested]  mbox.gz  Atom feed  top
2026-10-05 12:21 [PATCH v7 0/8] arm64: dts: monaco-arduino-monza: Add support for LGA WiFi/BT module Loic Poulain
2026-10-05 12:21 ` [PATCH v7 1/8] Bluetooth: hci_qca: Add M.2 Bluetooth device support using pwrseq Loic Poulain
2026-10-05 12:29   ` sashiko-bot
2026-10-05 13:01   ` bluez.test.bot [this message]
2026-10-05 12:21 ` [PATCH v7 2/8] Bluetooth: hci_qca: Rename 'power_ctrl_enabled' to 'bt_en_available' Loic Poulain
2026-10-05 12:28   ` sashiko-bot
2026-10-05 12:21 ` [PATCH v7 3/8] Bluetooth: hci_qca: Set 'bt_en_available' based on pwrseq power controllability Loic Poulain
2026-10-05 12:33   ` sashiko-bot
2026-10-05 12:21 ` [PATCH v7 4/8] Bluetooth: hci_qca: Embed bt_power in struct qca_serdev Loic Poulain
2026-10-05 12:29   ` sashiko-bot
2026-10-05 12:21 ` [PATCH v7 5/8] Bluetooth: hci_qca: Support QCA2066 on M.2 connector via pwrseq Loic Poulain
2026-10-05 12:33   ` sashiko-bot
2026-10-07 22:57   ` Val Packett
2026-10-05 12:21 ` [PATCH v7 6/8] Bluetooth: hci_qca: Flatten struct qca_power into struct qca_serdev Loic Poulain
2026-10-05 12:29   ` sashiko-bot
2026-10-05 12:21 ` [PATCH v7 7/8] dt-bindings: connector: pcie-m2-e: Add vendor LGA connector compatible Loic Poulain
2026-10-05 12:23   ` sashiko-bot
2026-10-05 12:21 ` [PATCH v7 8/8] arm64: dts: qcom: monaco-arduino-monza: Add QCA2066 M.2 WiFi/BT support Loic Poulain
2026-10-05 12:37   ` sashiko-bot
  -- strict thread matches above, loose matches on Subject: below --
2026-09-04 15:42 [PATCH v6 01/11] Bluetooth: hci_qca: Add M.2 Bluetooth device support using pwrseq Loic Poulain
2026-09-04 17:21 ` arm64: dts: monaco-arduino-monza: Add support for LGA WiFi/BT module bluez.test.bot
2026-07-20  8:04 [PATCH v5 01/11] Bluetooth: hci_qca: Add M.2 Bluetooth device support using pwrseq Loic Poulain
2026-07-20  9:51 ` arm64: dts: monaco-arduino-monza: Add support for LGA WiFi/BT module bluez.test.bot
2026-07-16 16:18 [PATCH v4 01/11] Bluetooth: hci_qca: Add M.2 Bluetooth device support using pwrseq Loic Poulain
2026-07-16 16:55 ` arm64: dts: monaco-arduino-monza: Add support for LGA WiFi/BT module bluez.test.bot
2026-07-10  9:57 [PATCH v3 01/11] Bluetooth: hci_qca: Add M.2 Bluetooth device support using pwrseq Loic Poulain
2026-07-10 10:44 ` arm64: dts: monaco-arduino-monza: Add support for LGA WiFi/BT module bluez.test.bot
2026-07-02 10:46 [PATCH v2 1/4] dt-bindings: connector: pcie-m2-e: Add vendor LGA connector compatible Loic Poulain
2026-07-02 12:29 ` arm64: dts: monaco-arduino-monza: Add support for LGA WiFi/BT module bluez.test.bot

Reply instructions:

You may reply publicly to this message via plain-text email
using any one of the following methods:

* Save the following mbox file, import it into your mail client,
  and reply-to-all from there: mbox

  Avoid top-posting and favor interleaved quoting:
  https://en.wikipedia.org/wiki/Posting_style#Interleaved_style

* Reply using the --to, --cc, and --in-reply-to
  switches of git-send-email(1):

  git send-email \
    --in-reply-to=6ac39fbb.edd3b74b.8e035.44ad@mx.google.com \
    --to=bluez.test.bot@gmail.com \
    --cc=linux-bluetooth@vger.kernel.org \
    --cc=loic.poulain@oss.qualcomm.com \
    /path/to/YOUR_REPLY

  https://kernel.org/pub/software/scm/git/docs/git-send-email.html

* If your mail client supports setting the In-Reply-To header
  via mailto: links, try the mailto: link
Be sure your reply has a Subject: header at the top and a blank line before the message body.
This is an external index of several public inboxes,
see mirroring instructions on how to clone and mirror
all data and code used by this external index.