messages from 2026-10-18 06:48:06 to 2026-10-18 08:17:59 UTC [more...]
[BUG] kernel BUG in ocfs2_recover_node
2026-10-18 8:17 UTC
[PATCHSET v3 sched_ext/for-7.4] sched_ext: Report a sub-scheduler's ecaps on attach, detach and cpu hotplug
2026-10-18 8:16 UTC (9+ messages)
` [PATCH 2/6] sched_ext: Free a sub-scheduler a grace period after discarding its ecaps syncs
` [PATCH 5/6] sched_ext: Report the ecaps loss when a cpu goes offline
[PATCH] perf python: Set up callchain parameters for sessions
2026-10-18 8:14 UTC
[BUG] KASAN: slab-out-of-bounds Read in copy_folio_from_iter_atomic
2026-10-18 8:12 UTC
[PATCH v2] KVM: arm64: Only enable S1PIE and S1POE with the features they imply
2026-10-18 8:09 UTC
[PATCH 08/10] mm/hugetlb: tolerate UFFD_WP markers outside uffd-wp VMAs
2026-10-18 8:07 UTC (2+ messages)
[PATCH v2 0/5] alpha: perf register sampling and user stack dumps
2026-10-18 8:07 UTC (3+ messages)
` [PATCH v2 4/5] alpha: add HAVE_PERF_REGS and HAVE_PERF_USER_STACK_DUMP support
[PATCH 6.18 00/52] 6.18.58-rc1 review
2026-10-18 8:05 UTC (2+ messages)
Clarification on a possible rtl8723bs cleanup patch
2026-10-18 8:04 UTC
[PATCH 07/10] mm/hugetlb: tolerate uffd bits set without uffd for PROT_NONE PTEs
2026-10-18 7:59 UTC (2+ messages)
[mszeredi-fuse:for-next 29/52] make[1]: *** No rule to make target 'fuse_symlink_cache_test.c', needed by 'tools/testing/selftests/filesystems/fuse/fuse_symlink_cache_test'
2026-10-18 7:46 UTC
drivers/gpu/drm/xe/xe_pci.c:758:undefined reference to `xe_configfs_primary_gt_allowed'
2026-10-18 7:49 UTC
[linux-next:master 16865/18293] vmlinux.o: error: objtool: do_jit(): unexpected end of section .text.do_jit
2026-10-18 7:46 UTC
drivers/net/ethernet/airoha/airoha_eth.c:2139 airoha_qdma_set_chan_tx_sched() warn: subtract is higher precedence than shift
2026-10-18 7:46 UTC
drivers/net/ethernet/airoha/airoha_eth.c:1843 airoha_enable_gdm2_loopback() warn: subtract is higher precedence than shift
2026-10-18 7:49 UTC
[linux-next:master 13462/18293] drivers/net/wireless/mediatek/mt76/mt7925/mcu.c:2488 mt7925_mcu_uni_add_beacon_offload() error: __builtin_memcpy() 'req.beacon_tlv.pkt' too small (510 vs 512)
2026-10-18 7:49 UTC
[thomas-weissschuh:b4/auxclock-nanosleep 17/42] ERROR: modpost: kernel/time/time_tests.ko: symbol '__mulsi3' undefined!
2026-10-18 7:49 UTC
[jpirko-mlxsw:wip_attestation_all_1 43/62] drivers/ctlv/core.c:644:6: warning: 'ctlv_device_priv_aligned' defined but not used
2026-10-18 7:43 UTC
drivers/edac/versalnet_edac.c:785 init_one_mc() error: buffer overflow 'priv->adec' 152 <= s32max
2026-10-18 7:48 UTC
[mszeredi-fuse:for-next 24/52] fuse_mnt.c:46:49: error: parameter 6 ('flags') has incomplete type
2026-10-18 7:43 UTC
[linux-next:master 18057/18293] mips-linux-ld: fs/fuse/dev.c:undefined reference to `fuse_backing_open_64'
2026-10-18 7:49 UTC
xtensa-linux-ld: drivers/gpu/drm/xe/xe_pci.c:906:undefined reference to `xe_configfs_primary_gt_allowed'
2026-10-18 7:50 UTC
[android-common:android17-6.18-p3s 27/27] arch/arm64/kvm/hyp/nvhe/../../../../../drivers/iommu/arm/arm-smmu-v3/pkvm/nested/arm-smmu-v3.c:410:15: sparse: sparse: cast to restricted __le64
2026-10-18 7:43 UTC
[tip:sched/core 35/37] ld.lld: error: relocation refers to a symbol in a discarded section: __UNIQUE_ID_addressable_overflowuid_553
2026-10-18 7:46 UTC
xtensa-linux-ld: drivers/gpu/drm/xe/xe_lrc.c:1145:undefined reference to `xe_configfs_get_ctx_restore_mid_bb'
2026-10-18 7:43 UTC
[android-common:android16-6.12-kminext 1/1] drivers/gpu/drm/xe/xe_device.c:699 xe_device_probe() warn: missing unwind goto?
2026-10-18 7:45 UTC
xe_guc.c:undefined reference to `xe_configfs_get_psmi_enabled'
2026-10-18 7:46 UTC
[broonie-sound:for-7.4 37/72] sound/soc/soc-dapm.c:2893 snd_soc_dapm_free_widget() warn: variable dereferenced before check 'w->dapm' (see line 2891)
2026-10-18 7:49 UTC
drivers/net/ethernet/airoha/airoha_ppe.c:122 airoha_ppe_set_xmit_frame_size() warn: subtract is higher precedence than shift
2026-10-18 7:49 UTC
[android-common:android17-6.18-p3s 27/27] arch/arm64/kvm/hyp/nvhe/../../../../../drivers/iommu/arm/arm-smmu-v3/pkvm/nested/arm-smmu-v3.c:371:28: sparse: sparse: incorrect type in assignment (different base types)
2026-10-18 7:43 UTC
[android-common:mirror-chromeos-5.10-arcvm 0/7] drivers/cpufreq/goldfish_cpufreq_stats.c:28:35: warning: integer literal is too large to be represented in type 'long', interpreting as 'unsigned long' per C89; this literal will have type 'long long' in C99 onwards
2026-10-18 7:43 UTC
[android-common:android16-6.12-kminext 1/1] drivers/scsi/smartpqi/smartpqi_init.c:5993 pqi_is_parity_write_stream() warn: inconsistent indenting
2026-10-18 7:46 UTC
[linux-next:master 18057/18293] undefined reference to `fuse_backing_open_64'
2026-10-18 7:46 UTC
[hid:for-7.4/wacom 8/8] drivers/hid/wacom_wac.c:4430:71: sparse: sparse: incorrect type in argument 1 (different address spaces)
2026-10-18 7:49 UTC
[linux-next:master 12707/18293] arch/arm64/boot/dts/hisilicon/hi6220-hikey.dtb: dma@f7370000 (hisilicon,k3-dma-1.0): $nodename:0: 'dma@f7370000' does not match '^dma-controller(@.*)?$'
2026-10-18 7:50 UTC
[jpirko-mlxsw:wip_attestation_all_1 49/62] drivers/ctlv/tests/registration_kunit.c:1706:48: warning: variable 'init_info' is uninitialized when passed as a const pointer argument here
2026-10-18 7:43 UTC
[mszeredi-fuse:for-next 26/52] /usr/lib/gcc-cross/aarch64-linux-gnu/14/../../../../aarch64-linux-gnu/bin/ld: cannot find -lfuse3: No such file or directory
2026-10-18 7:43 UTC
[mszeredi-fuse:for-next 26/52] /usr/lib/gcc-cross/powerpc64-linux-gnu/14/../../../../powerpc64-linux-gnu/bin/ld: cannot find -lfuse3: No such file or directory
2026-10-18 7:43 UTC
[android-common:android16-6.12-kminext 1/1] drivers/misc/pci_endpoint_test.c:292 pci_endpoint_test_bar() warn: signedness bug returning '(-61)'
2026-10-18 7:43 UTC
[android-common:android17-6.18 1/1] drivers/pinctrl/qcom/pinctrl-sdm660-lpass-lpi.c:79:27: sparse: sparse: symbol 'sdm660_lpi_pinctrl_groups' was not declared. Should it be static?
2026-10-18 7:45 UTC
[linux-next:master 15601/18293] timer-mediatek.c:(.text+0x359): dangerous relocation: windowed longcall crosses 1GB boundary; return may fail: *UND*
2026-10-18 7:50 UTC
[hid:for-7.4/nintendo 2/5] ERROR: modpost: drivers/hid/hid-nintendo.ko: symbol 'hid_is_usb' undefined!
2026-10-18 7:49 UTC
[broonie-sound:for-7.4 65/72] sound/soc/mediatek/mt8195/mt8195-dai-etdm.c:1610 mtk_dai_etdm_startup() warn: missing unwind goto?
2026-10-18 7:50 UTC
[android-common:android16-6.12-kminext 1/1] drivers/net/ethernet/qlogic/qede/qede_fp.c:989 qede_tpa_end() error: testing array offset 'i' after use
2026-10-18 7:46 UTC
[PATCH] perf python: Accept events larger than union perf_event
2026-10-18 7:48 UTC (2+ messages)
[PATCH 0/2] Fix pid probes on noninvasively grabbed processes
2026-10-18 7:46 UTC (6+ messages)
` [PATCH 1/2] libproc: name objects by their mapped file when there is no link map
` [PATCH 2/2] test: add pid probe test for noninvasively grabbed processes
[PATCH] iommu/amd: Skip non-IVMD entries when parsing IVRS memory definitions
2026-10-18 7:45 UTC
[PATCH] btrfs: prevent deleting the wrong subvolume by ID
2026-10-18 7:37 UTC
[PATCH v2] iio: accel: adxl345: update period cache after successful write
2026-10-18 7:40 UTC (3+ messages)
[PATCH v2 0/2] iio: accel: adxl345: propagate event regmap errors
2026-10-18 7:40 UTC (4+ messages)
` [PATCH v2 1/2] iio: accel: adxl345: propagate errors when reading event configuration
WARNING in bpf_update_branch_counts - scc exit with global bpf_throw subprog in a loop
2026-10-18 7:32 UTC
[asahilinux:bits/240-isp 63/92] drivers/media/platform/apple/avd/avd-vp9.c:197:8: error: call to undeclared function 'FIELD_PREP'; ISO C99 and later do not support implicit function declarations
2026-10-18 7:28 UTC
[asahilinux:bits/200-dcp 191/212] Warning: drivers/gpu/drm/apple/dcp.c:108 function parameter 'crtc' not described in 'dcp_crtc_send_page_flip_event'
2026-10-18 7:28 UTC
[PATCH BlueZ] a2dp: Remove duplicate check in transport_cb
2026-10-18 7:27 UTC (2+ messages)
` [BlueZ] "
[PATCH BlueZ] emulator: Avoid variable length array in send_cmd
2026-10-18 7:22 UTC (2+ messages)
` [BlueZ] "
[syzbot] [bluetooth?] WARNING in hci_recv_frame (2)
2026-10-18 7:19 UTC (2+ messages)
[PATCH RFC v2 0/3] arm64: dts: qcom: nord: Enable SoCCP remoteproc support
2026-10-18 7:16 UTC (4+ messages)
` [PATCH RFC v2 1/3] arm64: dts: qcom: nord: Add SoCCP remoteproc DT support for Nord
` [PATCH RFC v2 2/3] arm64: dts: qcom: nord: Add SoCCP on RRD board
` [PATCH RFC v2 3/3] arm64: dts: qcom: nord: Add SoCCP on Ride-Embedded board
[PATCH] block: annotate lockless task ioprio accesses
2026-10-18 7:16 UTC
[PATCH 06/10] mm/hugetlb: fix endless write fault on a leftover uffd bit
2026-10-18 7:11 UTC (2+ messages)
[RFC PATCH 0/6] KEYS: From assoc_array to rhashtable migration
2026-10-18 7:08 UTC (3+ messages)
` [RFC PATCH 5/6] KEYS: Replace assoc_array with struct keyring_index
[PATCH] iio: common: cros_ec_sensors: use sensor_scale union member for CALIBSCALE
2026-10-18 7:05 UTC (6+ messages)
[PATCH wireless] wifi: b43: keep the N-PHY TX power control from drifting while idle
2026-10-18 7:04 UTC (3+ messages)
[PATCH] io_uring: clear IO_RING_F_DRAIN_ACTIVE on drain completion flush
2026-10-18 7:01 UTC
perf build: default build fails in pylint (pylint 4, missing optional modules)
2026-10-18 7:01 UTC
[PATCH] wifi: brcmfmac: use ISO3166 country code fallback on 43752
2026-10-18 6:52 UTC
[PATCH 00/18 v2] Improving latency of short slice tasks
2026-10-18 6:57 UTC (3+ messages)
` [PATCH 07/18] sched/fair: Add push task mechanism for fair
[PATCH] perf pmu-events: Fix jevents.py type annotations for mypy 2.x
2026-10-18 6:55 UTC (2+ messages)
[PATCH v3 0/2] media: rcar-isp: fix core registration and IRQ lifetime
2026-10-18 6:54 UTC (3+ messages)
` [PATCH v3 1/2] media: rcar-isp: distinguish absent cores from registration failures
[PATCH 05/10] mm/hugetlb: don't clear the resv_map of a VMA whose lock is held
2026-10-18 6:53 UTC (2+ messages)
[PATCH] greybus: operation: arm the timeout timer before sending the request
2026-10-18 6:52 UTC
[PATCH v1] driver core: Don't take the device lock in waiting_for_supplier_show()
2026-10-18 6:51 UTC (2+ messages)
[PATCH v3 0/7] sched: Flatten the pick
2026-10-18 6:49 UTC (4+ messages)
` [PATCH v3 7/7] sched/eevdf: Move to a single runqueue
regression 6.18.57: acpi power button vanished in machines running in qemu
2026-10-18 6:48 UTC (2+ messages)
page: | prev (newer) | latest
- recent:[subjects (threaded)|topics (new)|topics (active)]
This is an external index of several public inboxes,
see mirroring instructions on how to clone and mirror
all data and code used by this external index.