* arch/x86/Kconfig:2368: syntax error
@ 2026-09-29 17:34 kernel test robot
2026-09-30 10:18 ` Lorenzo Stoakes (ARM)
0 siblings, 1 reply; 2+ messages in thread
From: kernel test robot @ 2026-09-29 17:34 UTC (permalink / raw)
To: Lorenzo Stoakes (ARM); +Cc: oe-kbuild-all, 0day robot
tree: https://github.com/intel-lab-lkp/linux/commits/Lorenzo-Stoakes-ARM/kbuild-do-not-allocate-modinfo-in-vmlinux/20260923-181750
head: 7037b569f2880edc0732da253bce262da253ac12
commit: 7a5e3a047b46532027b586ea704af1fc8677ef19 kbuild: avoid re-running compiler and linker probes
date: 6 days ago
config: x86_64-rhel-9.4-ltp (attached as .config)
compiler: gcc-14 (Debian 14.2.0-19) 14.2.0
reproduce (this is a W=1 build): (https://download.01.org/0day-ci/archive/20260929/202609291906.GAlpG7h2-lkp@intel.com/reproduce)
If you fix the issue in a separate patch/commit (i.e. not just a new version of
the same patch/commit), kindly add following tags
| Reported-by: kernel test robot <lkp@intel.com>
| Closes: https://lore.kernel.org/oe-kbuild-all/202609291906.GAlpG7h2-lkp@intel.com/
All errors (new ones prefixed by >>):
scripts/Kconfig.toolchain:148: syntax error
scripts/Kconfig.toolchain:148: unknown statement "def_string"
scripts/Kconfig.toolchain:151: syntax error
scripts/Kconfig.toolchain:151: unknown statement "def_string"
scripts/Kconfig.toolchain:154: syntax error
scripts/Kconfig.toolchain:154: unknown statement "def_string"
scripts/Kconfig.toolchain:157: syntax error
scripts/Kconfig.toolchain:157: unknown statement "def_string"
scripts/Kconfig.toolchain:160: syntax error
scripts/Kconfig.toolchain:160: unknown statement "def_string"
scripts/Kconfig.toolchain:164: syntax error
scripts/Kconfig.toolchain:164: unknown statement "def_string"
scripts/Kconfig.toolchain:167: syntax error
scripts/Kconfig.toolchain:167: unknown statement "def_string"
scripts/Kconfig.toolchain:177: syntax error
scripts/Kconfig.toolchain:177: unknown statement "def_string"
scripts/Kconfig.toolchain:180: syntax error
scripts/Kconfig.toolchain:180: unknown statement "def_string"
scripts/Kconfig.toolchain:183: syntax error
scripts/Kconfig.toolchain:183: unknown statement "def_string"
scripts/Kconfig.toolchain:186: syntax error
scripts/Kconfig.toolchain:186: unknown statement "def_string"
scripts/Kconfig.toolchain:189: syntax error
scripts/Kconfig.toolchain:189: unknown statement "def_string"
scripts/Kconfig.toolchain:192: syntax error
scripts/Kconfig.toolchain:192: unknown statement "def_string"
scripts/Kconfig.toolchain:195: syntax error
scripts/Kconfig.toolchain:195: unknown statement "def_string"
scripts/Kconfig.toolchain:198: syntax error
scripts/Kconfig.toolchain:198: unknown statement "def_string"
scripts/Kconfig.toolchain:204: syntax error
scripts/Kconfig.toolchain:204: unknown statement "def_string"
scripts/Kconfig.toolchain:207: syntax error
scripts/Kconfig.toolchain:207: unknown statement "def_string"
scripts/Kconfig.toolchain:210: syntax error
scripts/Kconfig.toolchain:210: unknown statement "def_string"
scripts/Kconfig.toolchain:213: syntax error
scripts/Kconfig.toolchain:213: unknown statement "def_string"
scripts/Kconfig.toolchain:216: syntax error
scripts/Kconfig.toolchain:216: unknown statement "def_string"
scripts/Kconfig.toolchain:219: syntax error
scripts/Kconfig.toolchain:219: unknown statement "def_string"
>> arch/x86/Kconfig:2368: syntax error
arch/x86/Kconfig:2368: unknown statement "def_string"
arch/x86/Kconfig:2371: syntax error
arch/x86/Kconfig:2371: unknown statement "def_string"
arch/x86/Kconfig:2376: syntax error
arch/x86/Kconfig:2376: unknown statement "def_string"
arch/x86/Kconfig:2379: syntax error
arch/x86/Kconfig:2379: unknown statement "def_string"
arch/x86/Kconfig:2382: syntax error
arch/x86/Kconfig:2382: unknown statement "def_string"
make[3]: *** [scripts/kconfig/Makefile:85: oldconfig] Error 1
make[2]: *** [Makefile:766: oldconfig] Error 2
make[1]: *** [Makefile:248: __sub-make] Error 2
make[1]: Target 'oldconfig' not remade because of errors.
make: *** [Makefile:248: __sub-make] Error 2
make: Target 'oldconfig' not remade because of errors.
--
scripts/Kconfig.toolchain:148: syntax error
scripts/Kconfig.toolchain:148: unknown statement "def_string"
scripts/Kconfig.toolchain:151: syntax error
scripts/Kconfig.toolchain:151: unknown statement "def_string"
scripts/Kconfig.toolchain:154: syntax error
scripts/Kconfig.toolchain:154: unknown statement "def_string"
scripts/Kconfig.toolchain:157: syntax error
scripts/Kconfig.toolchain:157: unknown statement "def_string"
scripts/Kconfig.toolchain:160: syntax error
scripts/Kconfig.toolchain:160: unknown statement "def_string"
scripts/Kconfig.toolchain:164: syntax error
scripts/Kconfig.toolchain:164: unknown statement "def_string"
scripts/Kconfig.toolchain:167: syntax error
scripts/Kconfig.toolchain:167: unknown statement "def_string"
scripts/Kconfig.toolchain:177: syntax error
scripts/Kconfig.toolchain:177: unknown statement "def_string"
scripts/Kconfig.toolchain:180: syntax error
scripts/Kconfig.toolchain:180: unknown statement "def_string"
scripts/Kconfig.toolchain:183: syntax error
scripts/Kconfig.toolchain:183: unknown statement "def_string"
scripts/Kconfig.toolchain:186: syntax error
scripts/Kconfig.toolchain:186: unknown statement "def_string"
scripts/Kconfig.toolchain:189: syntax error
scripts/Kconfig.toolchain:189: unknown statement "def_string"
scripts/Kconfig.toolchain:192: syntax error
scripts/Kconfig.toolchain:192: unknown statement "def_string"
scripts/Kconfig.toolchain:195: syntax error
scripts/Kconfig.toolchain:195: unknown statement "def_string"
scripts/Kconfig.toolchain:198: syntax error
scripts/Kconfig.toolchain:198: unknown statement "def_string"
scripts/Kconfig.toolchain:204: syntax error
scripts/Kconfig.toolchain:204: unknown statement "def_string"
scripts/Kconfig.toolchain:207: syntax error
scripts/Kconfig.toolchain:207: unknown statement "def_string"
scripts/Kconfig.toolchain:210: syntax error
scripts/Kconfig.toolchain:210: unknown statement "def_string"
scripts/Kconfig.toolchain:213: syntax error
scripts/Kconfig.toolchain:213: unknown statement "def_string"
scripts/Kconfig.toolchain:216: syntax error
scripts/Kconfig.toolchain:216: unknown statement "def_string"
scripts/Kconfig.toolchain:219: syntax error
scripts/Kconfig.toolchain:219: unknown statement "def_string"
>> arch/x86/Kconfig:2368: syntax error
arch/x86/Kconfig:2368: unknown statement "def_string"
arch/x86/Kconfig:2371: syntax error
arch/x86/Kconfig:2371: unknown statement "def_string"
arch/x86/Kconfig:2376: syntax error
arch/x86/Kconfig:2376: unknown statement "def_string"
arch/x86/Kconfig:2379: syntax error
arch/x86/Kconfig:2379: unknown statement "def_string"
arch/x86/Kconfig:2382: syntax error
arch/x86/Kconfig:2382: unknown statement "def_string"
make[3]: *** [scripts/kconfig/Makefile:85: olddefconfig] Error 1
make[2]: *** [Makefile:766: olddefconfig] Error 2
make[1]: *** [Makefile:248: __sub-make] Error 2
make[1]: Target 'olddefconfig' not remade because of errors.
make: *** [Makefile:248: __sub-make] Error 2
make: Target 'olddefconfig' not remade because of errors.
vim +2368 arch/x86/Kconfig
2344
2345 config CC_HAS_NAMED_AS_FIXED_SANITIZERS
2346 def_bool y
2347 depends on !(KASAN || KCSAN) || GCC_VERSION >= 130300
2348 depends on !(UBSAN_BOOL && KASAN) || GCC_VERSION >= 140200
2349
2350 config USE_X86_SEG_SUPPORT
2351 def_bool CC_HAS_NAMED_AS
2352 depends on CC_HAS_NAMED_AS_FIXED_SANITIZERS
2353
2354 config CC_HAS_SLS
2355 def_bool $(cc-option,-mharden-sls=all)
2356
2357 config CC_HAS_RETURN_THUNK
2358 def_bool $(cc-option,-mfunction-return=thunk-extern)
2359
2360 config CC_HAS_ENTRY_PADDING
2361 def_bool $(cc-option,-fpatchable-function-entry=16,16)
2362
2363 config CC_HAS_KCFI_ARITY
2364 def_bool $(cc-option,-fsanitize=kcfi -fsanitize-kcfi-arity)
2365 depends on CC_IS_CLANG && !RUST
2366
2367 config CC_OPT_INDIRECT_BRANCH_CS_PREFIX
> 2368 def_string "$(cc-option-str,-mindirect-branch-cs-prefix)"
2369
--
0-DAY CI Kernel Test Service
https://github.com/intel/lkp-tests/wiki
^ permalink raw reply [flat|nested] 2+ messages in thread
* Re: arch/x86/Kconfig:2368: syntax error
2026-09-29 17:34 arch/x86/Kconfig:2368: syntax error kernel test robot
@ 2026-09-30 10:18 ` Lorenzo Stoakes (ARM)
0 siblings, 0 replies; 2+ messages in thread
From: Lorenzo Stoakes (ARM) @ 2026-09-30 10:18 UTC (permalink / raw)
To: kernel test robot; +Cc: oe-kbuild-all
On Tue, Sep 29, 2026 at 07:34:56PM +0200, kernel test robot wrote:
> tree: https://github.com/intel-lab-lkp/linux/commits/Lorenzo-Stoakes-ARM/kbuild-do-not-allocate-modinfo-in-vmlinux/20260923-181750
> head: 7037b569f2880edc0732da253bce262da253ac12
> commit: 7a5e3a047b46532027b586ea704af1fc8677ef19 kbuild: avoid re-running compiler and linker probes
> date: 6 days ago
> config: x86_64-rhel-9.4-ltp (attached as .config)
> compiler: gcc-14 (Debian 14.2.0-19) 14.2.0
> reproduce (this is a W=1 build): (https://download.01.org/0day-ci/archive/20260929/202609291906.GAlpG7h2-lkp@intel.com/reproduce)
>
> If you fix the issue in a separate patch/commit (i.e. not just a new version of
> the same patch/commit), kindly add following tags
> | Reported-by: kernel test robot <lkp@intel.com>
> | Closes: https://lore.kernel.org/oe-kbuild-all/202609291906.GAlpG7h2-lkp@intel.com/
>
> All errors (new ones prefixed by >>):
>
> scripts/Kconfig.toolchain:148: syntax error
> scripts/Kconfig.toolchain:148: unknown statement "def_string"
Similar to the other robot report, this is just the dependencies not being
applied (as stated in cover letter).
--
Cheers, Lorenzo
^ permalink raw reply [flat|nested] 2+ messages in thread
end of thread, other threads:[~2026-09-30 10:18 UTC | newest]
Thread overview: 2+ messages (download: mbox.gz follow: Atom feed
-- links below jump to the message on this page --
2026-09-29 17:34 arch/x86/Kconfig:2368: syntax error kernel test robot
2026-09-30 10:18 ` Lorenzo Stoakes (ARM)
This is an external index of several public inboxes,
see mirroring instructions on how to clone and mirror
all data and code used by this external index.