* ❌ FAIL: Test report for for-kernelci (7.3.0-rc4, upstream-arm-next, d820e3ba)
@ 2026-10-15 4:42 cki-project
2026-10-15 11:24 ` Catalin Marinas
0 siblings, 1 reply; 2+ messages in thread
From: cki-project @ 2026-10-15 4:42 UTC (permalink / raw)
To: catalin.marinas, linux-arm-kernel, mmalik, will, omosnace
Hi, we tested your kernel and here are the results:
Overall result: FAILED
Merge: OK
Compile: OK
Test: FAILED
Kernel information:
Commit message: Merge branch 'for-next/fw-rmi' into for-next/core
You can find all the details about the test run at
https://datawarehouse.cki-project.org/kcidb/checkouts/redhat:2947827228
One or more kernel tests failed:
Unrecognized or new issues:
selinux-policy: serge-testsuite
aarch64
Logs: https://datawarehouse.cki-project.org/kcidb/tests/redhat:2947827228_aarch64_kernel_kcidb_tool_1200470666_8
Non-passing ran subtests:
❌ FAIL Test
We also see the following known issues which are not related to your changes:
Issue: [upstream] Hardware - Firmware test suite - auto-waive failures
URL: https://gitlab.com/cki-project/infrastructure/-/issues/779
Affected tests:
Hardware - Firmware test suite [aarch64]
If you find a failure unrelated to your changes, please ask the test maintainer to review it.
This will prevent the failures from being incorrectly reported in the future.
Please reply to this email if you have any questions about the tests that we
ran or if you have any suggestions on how to make future tests more effective.
,-. ,-.
( C ) ( K ) Continuous
`-',-.`-' Kernel
( I ) Integration
`-'
______________________________________________________________________________
^ permalink raw reply [flat|nested] 2+ messages in thread* Re: ❌ FAIL: Test report for for-kernelci (7.3.0-rc4, upstream-arm-next, d820e3ba)
2026-10-15 4:42 ❌ FAIL: Test report for for-kernelci (7.3.0-rc4, upstream-arm-next, d820e3ba) cki-project
@ 2026-10-15 11:24 ` Catalin Marinas
0 siblings, 0 replies; 2+ messages in thread
From: Catalin Marinas @ 2026-10-15 11:24 UTC (permalink / raw)
To: cki-project; +Cc: linux-arm-kernel, mmalik, will, omosnace
On Thu, Oct 15, 2026 at 04:42:05AM -0000, cki-project@redhat.com wrote:
> Hi, we tested your kernel and here are the results:
>
> Overall result: FAILED
> Merge: OK
> Compile: OK
> Test: FAILED
>
>
> Kernel information:
> Commit message: Merge branch 'for-next/fw-rmi' into for-next/core
>
> You can find all the details about the test run at
> https://datawarehouse.cki-project.org/kcidb/checkouts/redhat:2947827228
>
> One or more kernel tests failed:
> Unrecognized or new issues:
> selinux-policy: serge-testsuite
> aarch64
> Logs: https://datawarehouse.cki-project.org/kcidb/tests/redhat:2947827228_aarch64_kernel_kcidb_tool_1200470666_8
> Non-passing ran subtests:
> ❌ FAIL Test
>
> We also see the following known issues which are not related to your changes:
> Issue: [upstream] Hardware - Firmware test suite - auto-waive failures
> URL: https://gitlab.com/cki-project/infrastructure/-/issues/779
> Affected tests:
> Hardware - Firmware test suite [aarch64]
Is this another infrastructure issue? From the logs:
+ nft -f /root/selinux-testsuite/tests/sctp/nftables-flush
/root/selinux-testsuite/tests/sctp/nftables-flush:1:17-24: Error: Could not process rule: No such file or directory
delete table ip security
^^^^^^^^
Thanks.
--
Catalin
^ permalink raw reply [flat|nested] 2+ messages in thread
end of thread, other threads:[~2026-10-15 11:25 UTC | newest]
Thread overview: 2+ messages (download: mbox.gz follow: Atom feed
-- links below jump to the message on this page --
2026-10-15 4:42 ❌ FAIL: Test report for for-kernelci (7.3.0-rc4, upstream-arm-next, d820e3ba) cki-project
2026-10-15 11:24 ` Catalin Marinas
This is a public inbox, see mirroring instructions
for how to clone and mirror all data and code used for this inbox