0 day kernel build service
 help / color / mirror / Atom feed
* [intel-lts:6.18/linux 1/1] unix_listen.c:26:10: fatal error: kselftest_harness.h: No such file or directory
@ 2026-09-08 20:39 kernel test robot
  0 siblings, 0 replies; only message in thread
From: kernel test robot @ 2026-09-08 20:39 UTC (permalink / raw)
  To: oe-kbuild; +Cc: lkp

:::::: 
:::::: Manual check reason: "low confidence bisect report"
:::::: 

BCC: lkp@intel.com
CC: oe-kbuild-all@lists.linux.dev

tree:   https://github.com/intel/linux-intel-lts.git 6.18/linux
head:   fba0f76dc652f3ae4d38d5a486cad998d353c67f
commit: 814c5b1590037330381a4ae83aaf40c0986ba2bb [1/1] selftests/net/af_unix: test listen() rejects wrong socket states
:::::: branch date: 6 days ago
:::::: commit date: 4 weeks ago
config: i386-allnoconfig-bpf (https://download.01.org/0day-ci/archive/20260908/202609082248.MZqUA1cF-lkp@intel.com/config)
compiler: gcc-14 (Debian 14.2.0-19) 14.2.0
reproduce (this is a W=1 build): (https://download.01.org/0day-ci/archive/20260908/202609082248.MZqUA1cF-lkp@intel.com/reproduce)

If you fix the issue in a separate patch/commit (i.e. not just a new version of
the same patch/commit), kindly add following tags
| Reported-by: kernel test robot <lkp@intel.com>
| Closes: https://lore.kernel.org/r/202609082248.MZqUA1cF-lkp@intel.com/

Note: the intel-lts/6.18/linux HEAD fba0f76dc652f3ae4d38d5a486cad998d353c67f builds fine.
      It only hurts bisectability.

All errors (new ones prefixed by >>):

>> unix_listen.c:26:10: fatal error: kselftest_harness.h: No such file or directory
      26 | #include "kselftest_harness.h"
         |          ^~~~~~~~~~~~~~~~~~~~~
   compilation terminated.

--
0-DAY CI Kernel Test Service
https://github.com/intel/lkp-tests/wiki

^ permalink raw reply	[flat|nested] only message in thread

only message in thread, other threads:[~2026-09-08 20:40 UTC | newest]

Thread overview: (only message) (download: mbox.gz follow: Atom feed
-- links below jump to the message on this page --
2026-09-08 20:39 [intel-lts:6.18/linux 1/1] unix_listen.c:26:10: fatal error: kselftest_harness.h: No such file or directory kernel test robot

This is a public inbox, see mirroring instructions
for how to clone and mirror all data and code used for this inbox